KTT 236E


KTT236E is registered to a White 1967, Morris Minor 1000 with a Petrol engine. It Passed its most recent MOT Test on the 10 April 2019

4 unique faults (5 Total) reported in its MOT History (9 Tests).

1 common/recurring faults.

78% (7) MOT Pass Rate and a 22% (2) MOT Failure Rate.

38,321 recorded miles.

KTT 236E


KTT236E is registered to a White 1967, Morris Minor 1000 with a Petrol engine. It Passed its most recent MOT Test on the 10 April 2019

4 unique faults (5 Total) reported in its MOT History (9 Tests).

1 common/recurring faults.

78% (7) MOT Pass Rate and a 22% (2) MOT Failure Rate.

38,321 recorded miles.

MOT PASS/Failure rate for KTT 236E

all MOT test results for KTT 236E represented as a percentage
MOT PASS/Failure rate for KTT 236E
all MOT test results for KTT 236E represented as a percentage

PERCENTAGE OF VEHICLE FAULTS WITH KTT 236E

ALL REPORTED FAULTS, DISPLAYED BY PERCENTAGE OF OCCURRENCE DURING ALL MOT TESTS
PERCENTAGE OF VEHICLE FAULTS WITH KTT 236E
ALL REPORTED FAULTS, DISPLAYED BY PERCENTAGE OF OCCURRENCE DURING ALL MOT TESTS
ADVISORY

FAIL

KTT 236E annual Faults by type

ALL REPORTED FAULTS, DISPLAYED over time and categorised by type
KTT 236E annual Faults by type
ALL REPORTED FAULTS, DISPLAYED over time and categorised by type

ALL KTT 236E ADVISORIES [2]

ALL ADVISORIES, ORDERED by OCCURRENCE DURING KTT 236E's MOT HISTORY
ALL KTT 236E ADVISORIES [2]
ALL ADVISORIES, ORDERED by OCCURRENCE DURING KTT 236E's MOT HISTORY
Advisory Faults | source www.vehiclestats.co.uk
Fault Fault Test Date Test Date/Time Reference MOT Test Reference
2 Offside seat belt anchorage prescribed area is corroded but not considered excessive (5.2.6) Offside seat belt anchorage prescribed area is corroded but not considered excessive (5.2.6) 23 April 2013 [10:35] 23/04/2013 17 April 2013 [15:58] 17/04/2013 995773713197 995773713197 137577303152 137577303152

ALL KTT 236E Failure Faults [3]

ALL Failure faults, ORDERED by OCCURRENCE DURING KTT 236E's MOT HISTORY
ALL KTT 236E Failure Faults [3]
ALL Failure faults, ORDERED by OCCURRENCE DURING KTT 236E's MOT HISTORY
Fail Faults | source www.vehiclestats.co.uk
Fault Fault Test Date Test Date/Time Reference MOT Test Reference
1 Parking brake: efficiency below requirements (3.7.b.7) Parking brake: efficiency below requirements (3.7.b.7) 07 May 2014 [17:03] 07/05/2014 968947124176 968947124176
1 Brakes imbalanced across an axle (3.7.b.5b) Brakes imbalanced across an axle (3.7.b.5b) 07 May 2014 [17:03] 07/05/2014 968947124176 968947124176
1 Offside front upper axle king pin has excessive play in pin and/or bush adversely affecting the steering (2.5.a.3a) Offside front upper axle king pin has excessive play in pin and/or bush adversely affecting the steering (2.5.a.3a) 17 April 2013 [15:58] 17/04/2013 137577303152 137577303152

MOT TEST: 10 April 2019 10:15:37 PASSED
MOT TEST: 10 April 2019 10:15:37 PASSED

This test (442213221311) was completed on the 10 April 2019 10:15:37 and PASSED the requirements for a valid MOT with 0 comments.

This test (442213221311) was completed on the 10 April 2019 10:15:37 and PASSED the requirements for a valid MOT with 0 comments.

Recorded mileage: 38,321

Recorded mileage: 38,321


MOT TEST: 27 April 2018 11:10:10 PASSED
MOT TEST: 27 April 2018 11:10:10 PASSED

This test (556324258626) was completed on the 27 April 2018 11:10:10 and PASSED the requirements for a valid MOT with 0 comments.

This test (556324258626) was completed on the 27 April 2018 11:10:10 and PASSED the requirements for a valid MOT with 0 comments.

Recorded mileage: 38,241

Recorded mileage: 38,241


MOT TEST: 30 March 2017 14:26:47 PASSED
MOT TEST: 30 March 2017 14:26:47 PASSED

This test (547124961450) was completed on the 30 March 2017 14:26:47 and PASSED the requirements for a valid MOT with 0 comments.

This test (547124961450) was completed on the 30 March 2017 14:26:47 and PASSED the requirements for a valid MOT with 0 comments.

Recorded mileage: 38,146

Recorded mileage: 38,146


MOT TEST: 14 April 2016 11:14:41 PASSED
MOT TEST: 14 April 2016 11:14:41 PASSED

This test (673866525954) was completed on the 14 April 2016 11:14:41 and PASSED the requirements for a valid MOT with 0 comments.

This test (673866525954) was completed on the 14 April 2016 11:14:41 and PASSED the requirements for a valid MOT with 0 comments.

Recorded mileage: 38,138

Recorded mileage: 38,138


MOT TEST: 19 May 2015 10:50:37 PASSED
MOT TEST: 19 May 2015 10:50:37 PASSED

This test (267579935166) was completed on the 19 May 2015 10:50:37 and PASSED the requirements for a valid MOT with 0 comments.

This test (267579935166) was completed on the 19 May 2015 10:50:37 and PASSED the requirements for a valid MOT with 0 comments.

Recorded mileage: 37,794

Recorded mileage: 37,794


MOT TEST: 13 May 2014 08:47:14 PASSED
MOT TEST: 13 May 2014 08:47:14 PASSED

This test (646643134175) was completed on the 13 May 2014 08:47:14 and PASSED the requirements for a valid MOT with 0 comments.

This test (646643134175) was completed on the 13 May 2014 08:47:14 and PASSED the requirements for a valid MOT with 0 comments.

Recorded mileage: 37,418

Recorded mileage: 37,418


MOT TEST: 07 May 2014 17:03:30 FAILED
MOT TEST: 07 May 2014 17:03:30 FAILED

This test (968947124176) was completed on the 07 May 2014 17:03:30 and FAILED the requirements for a valid MOT with 2 comments.

This test (968947124176) was completed on the 07 May 2014 17:03:30 and FAILED the requirements for a valid MOT with 2 comments.

Recorded mileage: 37,418

Recorded mileage: 37,418


FAIL


MOT TEST: 23 April 2013 10:35:31 PASSED
MOT TEST: 23 April 2013 10:35:31 PASSED

This test (995773713197) was completed on the 23 April 2013 10:35:31 and PASSED the requirements for a valid MOT with 1 comments.

This test (995773713197) was completed on the 23 April 2013 10:35:31 and PASSED the requirements for a valid MOT with 1 comments.

Recorded mileage: 36,958

Recorded mileage: 36,958


ADVISORY


MOT TEST: 17 April 2013 15:58:43 FAILED
MOT TEST: 17 April 2013 15:58:43 FAILED

This test (137577303152) was completed on the 17 April 2013 15:58:43 and FAILED the requirements for a valid MOT with 2 comments.

This test (137577303152) was completed on the 17 April 2013 15:58:43 and FAILED the requirements for a valid MOT with 2 comments.

Recorded mileage: 36,893

Recorded mileage: 36,893


ADVISORY

FAIL