LNH 360G


LNH360G is registered to a Green 1969, Morris Minor 1000 with a Petrol engine. It Failed its most recent MOT Test on the 06 March 2013

25 unique faults (26 Total) reported in its MOT History (3 Tests).

1 common/recurring faults.

33% (1) MOT Pass Rate and a 67% (2) MOT Failure Rate.

56,400 recorded miles.

LNH 360G


LNH360G is registered to a Green 1969, Morris Minor 1000 with a Petrol engine. It Failed its most recent MOT Test on the 06 March 2013

25 unique faults (26 Total) reported in its MOT History (3 Tests).

1 common/recurring faults.

33% (1) MOT Pass Rate and a 67% (2) MOT Failure Rate.

56,400 recorded miles.

MOT PASS/Failure rate for LNH 360G

all MOT test results for LNH 360G represented as a percentage
MOT PASS/Failure rate for LNH 360G
all MOT test results for LNH 360G represented as a percentage

PERCENTAGE OF VEHICLE FAULTS WITH LNH 360G

ALL REPORTED FAULTS, DISPLAYED BY PERCENTAGE OF OCCURRENCE DURING ALL MOT TESTS
PERCENTAGE OF VEHICLE FAULTS WITH LNH 360G
ALL REPORTED FAULTS, DISPLAYED BY PERCENTAGE OF OCCURRENCE DURING ALL MOT TESTS
FAIL

USER ENTERED

LNH 360G annual Faults by type

ALL REPORTED FAULTS, DISPLAYED over time and categorised by type
LNH 360G annual Faults by type
ALL REPORTED FAULTS, DISPLAYED over time and categorised by type

ALL LNH 360G Failure Faults [24]

ALL Failure faults, ORDERED by OCCURRENCE DURING LNH 360G's MOT HISTORY
ALL LNH 360G Failure Faults [24]
ALL Failure faults, ORDERED by OCCURRENCE DURING LNH 360G's MOT HISTORY
Fail Faults | source www.vehiclestats.co.uk
Fault Fault Test Date Test Date/Time Reference MOT Test Reference
2 Nearside rear suspension spring mounting prescribed area is excessively corroded (2.4.a.3) Nearside rear suspension spring mounting prescribed area is excessively corroded (2.4.a.3) 06 March 2013 [13:58] 06/03/2013 25 April 2012 [10:58] 25/04/2012 476855563010 476855563010 208196912453 208196912453
1 Nearside front headlamp aim beam image obviously incorrect (1.8.a.1b) Nearside front headlamp aim beam image obviously incorrect (1.8.a.1b) 06 March 2013 [13:58] 06/03/2013 476855563010 476855563010
1 Front headlamp not working on dipped beam (1.7.5a) Front headlamp not working on dipped beam (1.7.5a) 06 March 2013 [13:58] 06/03/2013 476855563010 476855563010
1 Offside rear seat belt locking mechanism does not secure or release (5.2.5a) Offside rear seat belt locking mechanism does not secure or release (5.2.5a) 06 March 2013 [13:58] 06/03/2013 476855563010 476855563010
1 Nearside front suspension component mounting prescribed area is excessively corroded (2.4.a.3) Nearside front suspension component mounting prescribed area is excessively corroded (2.4.a.3) 06 March 2013 [13:58] 06/03/2013 476855563010 476855563010
1 Nearside front suspension component mounting prescribed area is deliberately modified which significantly reduces the original strength (2.4.a.3) Nearside front suspension component mounting prescribed area is deliberately modified which significantly reduces the original strength (2.4.a.3) 06 March 2013 [13:58] 06/03/2013 476855563010 476855563010
1 Front suspension component mounting prescribed area is excessively corroded (2.4.a.3) Front suspension component mounting prescribed area is excessively corroded (2.4.a.3) 06 March 2013 [13:58] 06/03/2013 476855563010 476855563010
1 Offside rear suspension spring mounting prescribed area is excessively corroded (2.4.a.3) Offside rear suspension spring mounting prescribed area is excessively corroded (2.4.a.3) 06 March 2013 [13:58] 06/03/2013 476855563010 476855563010
1 Nearside rear suspension spring mounting prescribed area is inadequately repaired (2.4.a.3) Nearside rear suspension spring mounting prescribed area is inadequately repaired (2.4.a.3) 06 March 2013 [13:58] 06/03/2013 476855563010 476855563010
1 Offside rear suspension spring mounting prescribed area is inadequately repaired (2.4.a.3) Offside rear suspension spring mounting prescribed area is inadequately repaired (2.4.a.3) 06 March 2013 [13:58] 06/03/2013 476855563010 476855563010
1 Offside rear rear brake recording little or no effort (3.7.b.5a) Offside rear rear brake recording little or no effort (3.7.b.5a) 06 March 2013 [13:58] 06/03/2013 476855563010 476855563010
1 Nearside rear rear parking brake recording little or no effort (3.7.b.6a) Nearside rear rear parking brake recording little or no effort (3.7.b.6a) 06 March 2013 [13:58] 06/03/2013 476855563010 476855563010
1 Parking brake: efficiency below requirements (3.7.b.7) Parking brake: efficiency below requirements (3.7.b.7) 06 March 2013 [13:58] 06/03/2013 476855563010 476855563010
1 Offside headlamp not working on dipped beam (1.7.5a) Offside headlamp not working on dipped beam (1.7.5a) 25 April 2012 [10:58] 25/04/2012 208196912453 208196912453
1 Nearside windscreen wiper not operating automatically when switched on (8.2.1b) Nearside windscreen wiper not operating automatically when switched on (8.2.1b) 25 April 2012 [10:58] 25/04/2012 208196912453 208196912453
1 Offside windscreen wiper not operating automatically when switched on (8.2.1b) Offside windscreen wiper not operating automatically when switched on (8.2.1b) 25 April 2012 [10:58] 25/04/2012 208196912453 208196912453
1 Nearside windscreen washer provides insufficient washer liquid (8.2.3) Nearside windscreen washer provides insufficient washer liquid (8.2.3) 25 April 2012 [10:58] 25/04/2012 208196912453 208196912453
1 Offside windscreen washer provides insufficient washer liquid (8.2.3) Offside windscreen washer provides insufficient washer liquid (8.2.3) 25 April 2012 [10:58] 25/04/2012 208196912453 208196912453
1 Horn not working (1.6.2a) Horn not working (1.6.2a) 25 April 2012 [10:58] 25/04/2012 208196912453 208196912453
1 Nearside front brake hose leaking (3.6.a.1) Nearside front brake hose leaking (3.6.a.1) 25 April 2012 [10:58] 25/04/2012 208196912453 208196912453
1 Nearside front brake hose excessively deteriorated (3.6.b.4d) Nearside front brake hose excessively deteriorated (3.6.b.4d) 25 April 2012 [10:58] 25/04/2012 208196912453 208196912453
1 Nearside stop lamp not working (1.2.1b) Nearside stop lamp not working (1.2.1b) 25 April 2012 [10:58] 25/04/2012 208196912453 208196912453
1 Offside stop lamp not working (1.2.1b) Offside stop lamp not working (1.2.1b) 25 April 2012 [10:58] 25/04/2012 208196912453 208196912453

ALL LNH 360G User Entered Faults [2]

ALL User Entered faults, ORDERED by OCCURRENCE DURING LNH 360G's MOT HISTORY
ALL LNH 360G User Entered Faults [2]
ALL User Entered faults, ORDERED by OCCURRENCE DURING LNH 360G's MOT HISTORY
Fail Faults | source www.vehiclestats.co.uk
Fault Fault Test Date Test Date/Time Reference MOT Test Reference
1 Advise general condition Advise general condition 06 March 2013 [13:58] 06/03/2013 476855563010 476855563010
1 Vin plate not permanently attached to vehicle Vin plate not permanently attached to vehicle 25 April 2012 [10:58] 25/04/2012 208196912453 208196912453

MOT TEST: 06 March 2013 13:58:52 FAILED
MOT TEST: 06 March 2013 13:58:52 FAILED

This test (476855563010) was completed on the 06 March 2013 13:58:52 and FAILED the requirements for a valid MOT with 14 comments.

This test (476855563010) was completed on the 06 March 2013 13:58:52 and FAILED the requirements for a valid MOT with 14 comments.

Recorded mileage: 56,400

Recorded mileage: 56,400


FAIL

USER ENTERED


MOT TEST: 27 April 2012 12:59:41 PASSED
MOT TEST: 27 April 2012 12:59:41 PASSED

This test (715698812199) was completed on the 27 April 2012 12:59:41 and PASSED the requirements for a valid MOT with 0 comments.

This test (715698812199) was completed on the 27 April 2012 12:59:41 and PASSED the requirements for a valid MOT with 0 comments.

Recorded mileage: 56,042

Recorded mileage: 56,042


MOT TEST: 25 April 2012 10:58:04 FAILED
MOT TEST: 25 April 2012 10:58:04 FAILED

This test (208196912453) was completed on the 25 April 2012 10:58:04 and FAILED the requirements for a valid MOT with 12 comments.

This test (208196912453) was completed on the 25 April 2012 10:58:04 and FAILED the requirements for a valid MOT with 12 comments.

Recorded mileage: 56,042

Recorded mileage: 56,042


FAIL

USER ENTERED