LNJ 136E


LNJ136E is registered to a Green 1968, Morris Minor with a Petrol engine. It Passed its most recent MOT Test on the 14 November 2018

13 unique faults (15 Total) reported in its MOT History (8 Tests).

2 common/recurring faults, the most frequent (2 times) is: Rear Surface heavy underseal to car slight surface corrosion at rear sills and leaf spring hanger points.

75% (6) MOT Pass Rate and a 25% (2) MOT Failure Rate.

36,207 recorded miles.

LNJ 136E


LNJ136E is registered to a Green 1968, Morris Minor with a Petrol engine. It Passed its most recent MOT Test on the 14 November 2018

13 unique faults (15 Total) reported in its MOT History (8 Tests).

2 common/recurring faults, the most frequent (2 times) is: Rear Surface heavy underseal to car slight surface corrosion at rear sills and leaf spring hanger points.

75% (6) MOT Pass Rate and a 25% (2) MOT Failure Rate.

36,207 recorded miles.

MOT PASS/Failure rate for LNJ 136E

all MOT test results for LNJ 136E represented as a percentage
MOT PASS/Failure rate for LNJ 136E
all MOT test results for LNJ 136E represented as a percentage

PERCENTAGE OF VEHICLE FAULTS WITH LNJ 136E

ALL REPORTED FAULTS, DISPLAYED BY PERCENTAGE OF OCCURRENCE DURING ALL MOT TESTS
PERCENTAGE OF VEHICLE FAULTS WITH LNJ 136E
ALL REPORTED FAULTS, DISPLAYED BY PERCENTAGE OF OCCURRENCE DURING ALL MOT TESTS
ADVISORY

FAIL

USER ENTERED

LNJ 136E annual Faults by type

ALL REPORTED FAULTS, DISPLAYED over time and categorised by type
LNJ 136E annual Faults by type
ALL REPORTED FAULTS, DISPLAYED over time and categorised by type

RECURRING FAULTS WITH LNJ 136E

FAULTS THAT HAVE OCCURED MORE THAN ONCE DURING LNJ 136E's MOT HISTORY
RECURRING FAULTS WITH LNJ 136E
FAULTS THAT HAVE OCCURED MORE THAN ONCE DURING LNJ 136E's MOT HISTORY
Fault Fault Test Date Test Date/Time Reference MOT Test Reference
2 Rear surface heavy underseal to car slight surface corrosion at rear sills and leaf spring hanger points Rear surface heavy underseal to car slight surface corrosion at rear sills and leaf spring hanger points 14 November 2018 [16:07] 14/11/2018 14 November 2018 [12:25] 14/11/2018 869855852433 869855852433 540706908515 540706908515
2 Welding has no penetration, and below standard. Welding has no penetration, and below standard. 08 February 2012 [09:46] 08/02/2012 07 February 2012 [11:03] 07/02/2012 928469632050 928469632050 949558932093 949558932093

ALL LNJ 136E ADVISORIES [5]

ALL ADVISORIES, ORDERED by OCCURRENCE DURING LNJ 136E's MOT HISTORY
ALL LNJ 136E ADVISORIES [5]
ALL ADVISORIES, ORDERED by OCCURRENCE DURING LNJ 136E's MOT HISTORY
Advisory Faults | source www.vehiclestats.co.uk
Fault Fault Test Date Test Date/Time Reference MOT Test Reference
2 Rear surface heavy underseal to car slight surface corrosion at rear sills and leaf spring hanger points Rear surface heavy underseal to car slight surface corrosion at rear sills and leaf spring hanger points 14 November 2018 [16:07] 14/11/2018 14 November 2018 [12:25] 14/11/2018 869855852433 869855852433 540706908515 540706908515
1 Offside front lower torque/reaction arm has a slightly deteriorated rubber bush (2.4.g.2) Offside front lower torque/reaction arm has a slightly deteriorated rubber bush (2.4.g.2) 19 June 2013 [15:38] 19/06/2013 556170473161 556170473161
1 Offside front torsion bar slight play at an end fixing (2.4.e.2) Offside front torsion bar slight play at an end fixing (2.4.e.2) 19 June 2013 [15:38] 19/06/2013 556170473161 556170473161
1 Offside front body has slight corrosion (6.1.b.2) Offside front body has slight corrosion (6.1.b.2) 21 April 2007 [11:25] 21/04/2007 143341417101 143341417101

ALL LNJ 136E Failure Faults [7]

ALL Failure faults, ORDERED by OCCURRENCE DURING LNJ 136E's MOT HISTORY
ALL LNJ 136E Failure Faults [7]
ALL Failure faults, ORDERED by OCCURRENCE DURING LNJ 136E's MOT HISTORY
Fail Faults | source www.vehiclestats.co.uk
Fault Fault Test Date Test Date/Time Reference MOT Test Reference
1 Nearside front outer steering rack gaiter missing or no longer prevents the ingress of dirt (2.1.3 (g) (ii)) Nearside front outer steering rack gaiter missing or no longer prevents the ingress of dirt (2.1.3 (g) (ii)) 14 November 2018 [12:25] 14/11/2018 540706908515 540706908515
1 Nearside headlamp aim beam image obviously incorrect (1.8.a.1b) Nearside headlamp aim beam image obviously incorrect (1.8.a.1b) 07 February 2012 [11:03] 07/02/2012 949558932093 949558932093
1 Offside headlamp aim beam image obviously incorrect (1.8.a.1b) Offside headlamp aim beam image obviously incorrect (1.8.a.1b) 07 February 2012 [11:03] 07/02/2012 949558932093 949558932093
1 Nearside rear stop lamp not working (1.2.1b) Nearside rear stop lamp not working (1.2.1b) 07 February 2012 [11:03] 07/02/2012 949558932093 949558932093
1 Nearside rear position lamp(s) has less than 50% of the light sources illuminating (1.1.a.3b) Nearside rear position lamp(s) has less than 50% of the light sources illuminating (1.1.a.3b) 07 February 2012 [11:03] 07/02/2012 949558932093 949558932093
1 Nearside rear brake recording little or no effort (3.7.b.5a) Nearside rear brake recording little or no effort (3.7.b.5a) 07 February 2012 [11:03] 07/02/2012 949558932093 949558932093
1 Parking brake: efficiency below requirements (3.7.b.7) Parking brake: efficiency below requirements (3.7.b.7) 07 February 2012 [11:03] 07/02/2012 949558932093 949558932093

ALL LNJ 136E User Entered Faults [3]

ALL User Entered faults, ORDERED by OCCURRENCE DURING LNJ 136E's MOT HISTORY
ALL LNJ 136E User Entered Faults [3]
ALL User Entered faults, ORDERED by OCCURRENCE DURING LNJ 136E's MOT HISTORY
User Entered Faults | source www.vehiclestats.co.uk
Fault Fault Test Date Test Date/Time Reference MOT Test Reference
2 Welding has no penetration, and below standard. Welding has no penetration, and below standard. 08 February 2012 [09:46] 08/02/2012 07 February 2012 [11:03] 07/02/2012 928469632050 928469632050 949558932093 949558932093
1 Under body repairs Under body repairs 19 June 2013 [15:38] 19/06/2013 556170473161 556170473161

MOT TEST: 14 November 2018 16:07:42 PASSED
MOT TEST: 14 November 2018 16:07:42 PASSED

This test (869855852433) was completed on the 14 November 2018 16:07:42 and PASSED the requirements for a valid MOT with 1 comments.

This test (869855852433) was completed on the 14 November 2018 16:07:42 and PASSED the requirements for a valid MOT with 1 comments.

Recorded mileage: 36,207

Recorded mileage: 36,207


ADVISORY


MOT TEST: 14 November 2018 12:25:51 FAILED
MOT TEST: 14 November 2018 12:25:51 FAILED

This test (540706908515) was completed on the 14 November 2018 12:25:51 and FAILED the requirements for a valid MOT with 2 comments.

This test (540706908515) was completed on the 14 November 2018 12:25:51 and FAILED the requirements for a valid MOT with 2 comments.

Recorded mileage: 36,206

Recorded mileage: 36,206


ADVISORY

FAIL


MOT TEST: 28 July 2014 14:56:44 PASSED
MOT TEST: 28 July 2014 14:56:44 PASSED

This test (238319504278) was completed on the 28 July 2014 14:56:44 and PASSED the requirements for a valid MOT with 0 comments.

This test (238319504278) was completed on the 28 July 2014 14:56:44 and PASSED the requirements for a valid MOT with 0 comments.

Recorded mileage: 35,879

Recorded mileage: 35,879


MOT TEST: 19 June 2013 15:38:48 PASSED
MOT TEST: 19 June 2013 15:38:48 PASSED

This test (556170473161) was completed on the 19 June 2013 15:38:48 and PASSED the requirements for a valid MOT with 3 comments.

This test (556170473161) was completed on the 19 June 2013 15:38:48 and PASSED the requirements for a valid MOT with 3 comments.

Recorded mileage: 35,787

Recorded mileage: 35,787


ADVISORY

USER ENTERED


MOT TEST: 08 February 2012 09:46:36 PASSED
MOT TEST: 08 February 2012 09:46:36 PASSED

This test (928469632050) was completed on the 08 February 2012 09:46:36 and PASSED the requirements for a valid MOT with 1 comments.

This test (928469632050) was completed on the 08 February 2012 09:46:36 and PASSED the requirements for a valid MOT with 1 comments.

Recorded mileage: 35,625

Recorded mileage: 35,625


USER ENTERED


MOT TEST: 07 February 2012 11:03:56 FAILED
MOT TEST: 07 February 2012 11:03:56 FAILED

This test (949558932093) was completed on the 07 February 2012 11:03:56 and FAILED the requirements for a valid MOT with 7 comments.

This test (949558932093) was completed on the 07 February 2012 11:03:56 and FAILED the requirements for a valid MOT with 7 comments.

Recorded mileage: 35,625

Recorded mileage: 35,625


FAIL

USER ENTERED


MOT TEST: 21 April 2007 11:25:06 PASSED
MOT TEST: 21 April 2007 11:25:06 PASSED

This test (143341417101) was completed on the 21 April 2007 11:25:06 and PASSED the requirements for a valid MOT with 1 comments.

This test (143341417101) was completed on the 21 April 2007 11:25:06 and PASSED the requirements for a valid MOT with 1 comments.

Recorded mileage: 34,589

Recorded mileage: 34,589


ADVISORY


MOT TEST: 12 April 2006 09:22:13 PASSED
MOT TEST: 12 April 2006 09:22:13 PASSED

This test (661752206175) was completed on the 12 April 2006 09:22:13 and PASSED the requirements for a valid MOT with 0 comments.

This test (661752206175) was completed on the 12 April 2006 09:22:13 and PASSED the requirements for a valid MOT with 0 comments.

Recorded mileage: 34,539

Recorded mileage: 34,539