LNP 156


LNP156 is registered to a Green 1953, Morris Oxford with a Petrol engine. It Failed its most recent MOT Test on the 16 April 2012

10 unique faults (10 Total) reported in its MOT History (12 Tests).

0 common/recurring faults.

58% (7) MOT Pass Rate and a 42% (5) MOT Failure Rate.

57,623 recorded miles.

LNP 156


LNP156 is registered to a Green 1953, Morris Oxford with a Petrol engine. It Failed its most recent MOT Test on the 16 April 2012

10 unique faults (10 Total) reported in its MOT History (12 Tests).

0 common/recurring faults.

58% (7) MOT Pass Rate and a 42% (5) MOT Failure Rate.

57,623 recorded miles.

MOT PASS/Failure rate for LNP 156

all MOT test results for LNP 156 represented as a percentage
MOT PASS/Failure rate for LNP 156
all MOT test results for LNP 156 represented as a percentage

PERCENTAGE OF VEHICLE FAULTS WITH LNP 156

ALL REPORTED FAULTS, DISPLAYED BY PERCENTAGE OF OCCURRENCE DURING ALL MOT TESTS
PERCENTAGE OF VEHICLE FAULTS WITH LNP 156
ALL REPORTED FAULTS, DISPLAYED BY PERCENTAGE OF OCCURRENCE DURING ALL MOT TESTS
ADVISORY

FAIL

LNP 156 annual Faults by type

ALL REPORTED FAULTS, DISPLAYED over time and categorised by type
LNP 156 annual Faults by type
ALL REPORTED FAULTS, DISPLAYED over time and categorised by type

ALL LNP 156 ADVISORIES [1]

ALL ADVISORIES, ORDERED by OCCURRENCE DURING LNP 156's MOT HISTORY
ALL LNP 156 ADVISORIES [1]
ALL ADVISORIES, ORDERED by OCCURRENCE DURING LNP 156's MOT HISTORY
Advisory Faults | source www.vehiclestats.co.uk
Fault Fault Test Date Test Date/Time Reference MOT Test Reference
1 Nearside front road wheel with a slightly distorted bead rim (4.2.a.1a) Nearside front road wheel with a slightly distorted bead rim (4.2.a.1a) 21 April 2008 [16:14] 21/04/2008 664602818186 664602818186

ALL LNP 156 Failure Faults [9]

ALL Failure faults, ORDERED by OCCURRENCE DURING LNP 156's MOT HISTORY
ALL LNP 156 Failure Faults [9]
ALL Failure faults, ORDERED by OCCURRENCE DURING LNP 156's MOT HISTORY
Fail Faults | source www.vehiclestats.co.uk
Fault Fault Test Date Test Date/Time Reference MOT Test Reference
1 Horn not working (1.6.2a) Horn not working (1.6.2a) 16 April 2012 [11:08] 16/04/2012 636687102135 636687102135
1 Nearside front headlamp not working on dipped beam (1.7.5a) Nearside front headlamp not working on dipped beam (1.7.5a) 26 March 2010 [12:19] 26/03/2010 833585080080 833585080080
1 Offside front headlamp not working on dipped beam (1.7.5a) Offside front headlamp not working on dipped beam (1.7.5a) 26 March 2010 [12:19] 26/03/2010 833585080080 833585080080
1 Nearside front headlamp not working on main beam (1.7.5a) Nearside front headlamp not working on main beam (1.7.5a) 26 March 2010 [12:19] 26/03/2010 833585080080 833585080080
1 Offside front headlamp not working on main beam (1.7.5a) Offside front headlamp not working on main beam (1.7.5a) 26 March 2010 [12:19] 26/03/2010 833585080080 833585080080
1 Offside front direction indicators not working (1.4.a.2c) Offside front direction indicators not working (1.4.a.2c) 26 March 2010 [12:19] 26/03/2010 833585080080 833585080080
1 Windscreen washer provides insufficient washer liquid (8.2.3) Windscreen washer provides insufficient washer liquid (8.2.3) 20 March 2009 [15:05] 20/03/2009 844099579087 844099579087
1 Offside front brake application uneven (3.7.b.2) Offside front brake application uneven (3.7.b.2) 11 April 2007 [15:30] 11/04/2007 781031107163 781031107163
1 Nearside front wheel bearing rough when rotated (2.5.a.2) Nearside front wheel bearing rough when rotated (2.5.a.2) 12 April 2006 [08:41] 12/04/2006 472841106126 472841106126

MOT TEST: 16 April 2012 14:02:12 PASSED
MOT TEST: 16 April 2012 14:02:12 PASSED

This test (106317602134) was completed on the 16 April 2012 14:02:12 and PASSED the requirements for a valid MOT with 0 comments.

This test (106317602134) was completed on the 16 April 2012 14:02:12 and PASSED the requirements for a valid MOT with 0 comments.

Recorded mileage: 57,623

Recorded mileage: 57,623


MOT TEST: 16 April 2012 11:08:33 FAILED
MOT TEST: 16 April 2012 11:08:33 FAILED

This test (636687102135) was completed on the 16 April 2012 11:08:33 and FAILED the requirements for a valid MOT with 1 comments.

This test (636687102135) was completed on the 16 April 2012 11:08:33 and FAILED the requirements for a valid MOT with 1 comments.

Recorded mileage: 57,623

Recorded mileage: 57,623


FAIL


MOT TEST: 23 March 2011 15:19:57 PASSED
MOT TEST: 23 March 2011 15:19:57 PASSED

This test (135182281003) was completed on the 23 March 2011 15:19:57 and PASSED the requirements for a valid MOT with 0 comments.

This test (135182281003) was completed on the 23 March 2011 15:19:57 and PASSED the requirements for a valid MOT with 0 comments.

Recorded mileage: 57,382

Recorded mileage: 57,382


MOT TEST: 26 March 2010 16:00:23 PASSED
MOT TEST: 26 March 2010 16:00:23 PASSED

This test (181225480038) was completed on the 26 March 2010 16:00:23 and PASSED the requirements for a valid MOT with 0 comments.

This test (181225480038) was completed on the 26 March 2010 16:00:23 and PASSED the requirements for a valid MOT with 0 comments.

Recorded mileage: 57,094

Recorded mileage: 57,094


MOT TEST: 26 March 2010 12:19:09 FAILED
MOT TEST: 26 March 2010 12:19:09 FAILED

This test (833585080080) was completed on the 26 March 2010 12:19:09 and FAILED the requirements for a valid MOT with 5 comments.

This test (833585080080) was completed on the 26 March 2010 12:19:09 and FAILED the requirements for a valid MOT with 5 comments.

Recorded mileage: 57,094

Recorded mileage: 57,094


FAIL


MOT TEST: 20 March 2009 16:15:07 PASSED
MOT TEST: 20 March 2009 16:15:07 PASSED

This test (443449079015) was completed on the 20 March 2009 16:15:07 and PASSED the requirements for a valid MOT with 0 comments.

This test (443449079015) was completed on the 20 March 2009 16:15:07 and PASSED the requirements for a valid MOT with 0 comments.

Recorded mileage: 56,609

Recorded mileage: 56,609


MOT TEST: 20 March 2009 15:05:20 FAILED
MOT TEST: 20 March 2009 15:05:20 FAILED

This test (844099579087) was completed on the 20 March 2009 15:05:20 and FAILED the requirements for a valid MOT with 1 comments.

This test (844099579087) was completed on the 20 March 2009 15:05:20 and FAILED the requirements for a valid MOT with 1 comments.

Recorded mileage: 56,609

Recorded mileage: 56,609


FAIL


MOT TEST: 21 April 2008 16:14:09 PASSED
MOT TEST: 21 April 2008 16:14:09 PASSED

This test (664602818186) was completed on the 21 April 2008 16:14:09 and PASSED the requirements for a valid MOT with 1 comments.

This test (664602818186) was completed on the 21 April 2008 16:14:09 and PASSED the requirements for a valid MOT with 1 comments.

Recorded mileage: 56,339

Recorded mileage: 56,339


ADVISORY


MOT TEST: 16 April 2007 14:03:27 PASSED
MOT TEST: 16 April 2007 14:03:27 PASSED

This test (134456607176) was completed on the 16 April 2007 14:03:27 and PASSED the requirements for a valid MOT with 0 comments.

This test (134456607176) was completed on the 16 April 2007 14:03:27 and PASSED the requirements for a valid MOT with 0 comments.

Recorded mileage: 56,020

Recorded mileage: 56,020


MOT TEST: 11 April 2007 15:30:23 FAILED
MOT TEST: 11 April 2007 15:30:23 FAILED

This test (781031107163) was completed on the 11 April 2007 15:30:23 and FAILED the requirements for a valid MOT with 1 comments.

This test (781031107163) was completed on the 11 April 2007 15:30:23 and FAILED the requirements for a valid MOT with 1 comments.

Recorded mileage: 56,020

Recorded mileage: 56,020


FAIL


MOT TEST: 20 April 2006 13:02:08 PASSED
MOT TEST: 20 April 2006 13:02:08 PASSED

This test (754390116109) was completed on the 20 April 2006 13:02:08 and PASSED the requirements for a valid MOT with 0 comments.

This test (754390116109) was completed on the 20 April 2006 13:02:08 and PASSED the requirements for a valid MOT with 0 comments.

Recorded mileage: 55,695

Recorded mileage: 55,695


MOT TEST: 12 April 2006 08:41:34 FAILED
MOT TEST: 12 April 2006 08:41:34 FAILED

This test (472841106126) was completed on the 12 April 2006 08:41:34 and FAILED the requirements for a valid MOT with 1 comments.

This test (472841106126) was completed on the 12 April 2006 08:41:34 and FAILED the requirements for a valid MOT with 1 comments.

Recorded mileage: 55,695

Recorded mileage: 55,695


FAIL