LPM 902E


LPM902E is registered to a Grey 1967, Morris Minor 1000 with a Petrol engine. It Failed its most recent MOT Test on the 26 February 2009

45 unique faults (50 Total) reported in its MOT History (7 Tests).

4 common/recurring faults, the most frequent (2 times) is: Nearside Rear Suspension spring mounting prescribed area is excessively corroded (2.4.A.3).

29% (2) MOT Pass Rate and a 71% (5) MOT Failure Rate.

26,218 recorded miles.

LPM 902E


LPM902E is registered to a Grey 1967, Morris Minor 1000 with a Petrol engine. It Failed its most recent MOT Test on the 26 February 2009

45 unique faults (50 Total) reported in its MOT History (7 Tests).

4 common/recurring faults, the most frequent (2 times) is: Nearside Rear Suspension spring mounting prescribed area is excessively corroded (2.4.A.3).

29% (2) MOT Pass Rate and a 71% (5) MOT Failure Rate.

26,218 recorded miles.

MOT PASS/Failure rate for LPM 902E

all MOT test results for LPM 902E represented as a percentage
MOT PASS/Failure rate for LPM 902E
all MOT test results for LPM 902E represented as a percentage

PERCENTAGE OF VEHICLE FAULTS WITH LPM 902E

ALL REPORTED FAULTS, DISPLAYED BY PERCENTAGE OF OCCURRENCE DURING ALL MOT TESTS
PERCENTAGE OF VEHICLE FAULTS WITH LPM 902E
ALL REPORTED FAULTS, DISPLAYED BY PERCENTAGE OF OCCURRENCE DURING ALL MOT TESTS
ADVISORY

FAIL

USER ENTERED

PASS WITH RECTIFICATION

LPM 902E annual Faults by type

ALL REPORTED FAULTS, DISPLAYED over time and categorised by type
LPM 902E annual Faults by type
ALL REPORTED FAULTS, DISPLAYED over time and categorised by type

RECURRING FAULTS WITH LPM 902E

FAULTS THAT HAVE OCCURED MORE THAN ONCE DURING LPM 902E's MOT HISTORY
RECURRING FAULTS WITH LPM 902E
FAULTS THAT HAVE OCCURED MORE THAN ONCE DURING LPM 902E's MOT HISTORY
Fault Fault Test Date Test Date/Time Reference MOT Test Reference
2 Nearside rear suspension spring mounting prescribed area is excessively corroded (2.4.a.3) Nearside rear suspension spring mounting prescribed area is excessively corroded (2.4.a.3) 26 February 2009 [13:16] 26/02/2009 19 June 2007 [16:42] 19/06/2007 612247759061 612247759061 433580677164 433580677164
2 Parking brake: efficiency below requirements (3.7.b.7) Parking brake: efficiency below requirements (3.7.b.7) 26 February 2009 [13:16] 26/02/2009 19 June 2007 [16:42] 19/06/2007 612247759061 612247759061 433580677164 433580677164
2 Nearside front front position lamp(s) not working (1.1.a.3b) Nearside front front position lamp(s) not working (1.1.a.3b) 29 July 2008 [14:16] 29/07/2008 13 June 2006 [09:02] 13/06/2006 631111118250 631111118250 661414866161 661414866161
2 Nearside front position lamp(s) not working (1.1.a.3b) Nearside front position lamp(s) not working (1.1.a.3b) 04 July 2007 [13:42] 04/07/2007 19 June 2007 [16:42] 19/06/2007 234775787167 234775787167 433580677164 433580677164

ALL LPM 902E ADVISORIES [4]

ALL ADVISORIES, ORDERED by OCCURRENCE DURING LPM 902E's MOT HISTORY
ALL LPM 902E ADVISORIES [4]
ALL ADVISORIES, ORDERED by OCCURRENCE DURING LPM 902E's MOT HISTORY
Fail Faults | source www.vehiclestats.co.uk
Fault Fault Test Date Test Date/Time Reference MOT Test Reference
1 Nearside rear suspension spring mounting prescribed area is corroded but not considered excessive (2.4.a.3) Nearside rear suspension spring mounting prescribed area is corroded but not considered excessive (2.4.a.3) 26 February 2009 [13:16] 26/02/2009 612247759061 612247759061
1 Offside rear suspension spring mounting prescribed area is corroded but not considered excessive (2.4.a.3) Offside rear suspension spring mounting prescribed area is corroded but not considered excessive (2.4.a.3) 26 February 2009 [13:16] 26/02/2009 612247759061 612247759061
1 Nearside front brake hose slightly deteriorated (3.6.b.4d) Nearside front brake hose slightly deteriorated (3.6.b.4d) 29 July 2008 [14:16] 29/07/2008 631111118250 631111118250
1 Nearside front tyre worn close to the legal limit (4.1.e.1) Nearside front tyre worn close to the legal limit (4.1.e.1) 29 July 2008 [14:16] 29/07/2008 631111118250 631111118250

ALL LPM 902E Failure Faults [38]

ALL Failure faults, ORDERED by OCCURRENCE DURING LPM 902E's MOT HISTORY
ALL LPM 902E Failure Faults [38]
ALL Failure faults, ORDERED by OCCURRENCE DURING LPM 902E's MOT HISTORY
Fail Faults | source www.vehiclestats.co.uk
Fault Fault Test Date Test Date/Time Reference MOT Test Reference
2 Nearside rear suspension spring mounting prescribed area is excessively corroded (2.4.a.3) Nearside rear suspension spring mounting prescribed area is excessively corroded (2.4.a.3) 26 February 2009 [13:16] 26/02/2009 19 June 2007 [16:42] 19/06/2007 612247759061 612247759061 433580677164 433580677164
2 Parking brake: efficiency below requirements (3.7.b.7) Parking brake: efficiency below requirements (3.7.b.7) 26 February 2009 [13:16] 26/02/2009 19 June 2007 [16:42] 19/06/2007 612247759061 612247759061 433580677164 433580677164
2 Nearside front front position lamp(s) not working (1.1.a.3b) Nearside front front position lamp(s) not working (1.1.a.3b) 29 July 2008 [14:16] 29/07/2008 13 June 2006 [09:02] 13/06/2006 631111118250 631111118250 661414866161 661414866161
1 Nearside front lower seat belt anchorage prescribed area is excessively corroded (5.2.6) Nearside front lower seat belt anchorage prescribed area is excessively corroded (5.2.6) 26 February 2009 [13:16] 26/02/2009 612247759061 612247759061
1 Offside front lower seat belt anchorage prescribed area is excessively corroded (5.2.6) Offside front lower seat belt anchorage prescribed area is excessively corroded (5.2.6) 26 February 2009 [13:16] 26/02/2009 612247759061 612247759061
1 Offside front brake master cylinder/servo mounting prescribed area is excessively corroded (3.6.c.3) Offside front brake master cylinder/servo mounting prescribed area is excessively corroded (3.6.c.3) 26 February 2009 [13:16] 26/02/2009 612247759061 612247759061
1 Brake pedal creeps down when held under pressure (3.3.b.1a) Brake pedal creeps down when held under pressure (3.3.b.1a) 26 February 2009 [13:16] 26/02/2009 612247759061 612247759061
1 Brake performance not tested (3.7.a.1) Brake performance not tested (3.7.a.1) 26 February 2009 [13:16] 26/02/2009 612247759061 612247759061
1 Service brake: efficiency below requirements (3.7.b.7) Service brake: efficiency below requirements (3.7.b.7) 26 February 2009 [13:16] 26/02/2009 612247759061 612247759061
1 Offside front front position lamp(s) not working (1.1.a.3b) Offside front front position lamp(s) not working (1.1.a.3b) 29 July 2008 [14:16] 29/07/2008 631111118250 631111118250
1 Nearside front hazard warning lamps not flashing in phase, with ignition on (1.4.b.1f) Nearside front hazard warning lamps not flashing in phase, with ignition on (1.4.b.1f) 29 July 2008 [14:16] 29/07/2008 631111118250 631111118250
1 Nearside front hazard warning lamps not flashing in phase, with ignition off (1.4.b.1f) Nearside front hazard warning lamps not flashing in phase, with ignition off (1.4.b.1f) 29 July 2008 [14:16] 29/07/2008 631111118250 631111118250
1 Nearside front direction indicator not working (1.4.a.2c) Nearside front direction indicator not working (1.4.a.2c) 29 July 2008 [14:16] 29/07/2008 631111118250 631111118250
1 Nearside front suspension component mounting prescribed area is excessively corroded (2.4.a.3) Nearside front suspension component mounting prescribed area is excessively corroded (2.4.a.3) 29 July 2008 [14:16] 29/07/2008 631111118250 631111118250
1 Offside front suspension component mounting prescribed area is excessively corroded (2.4.a.3) Offside front suspension component mounting prescribed area is excessively corroded (2.4.a.3) 29 July 2008 [14:16] 29/07/2008 631111118250 631111118250
1 Offside rear bonded suspension unit attachment corroded and seriously weakened (2.4.f.1c) Offside rear bonded suspension unit attachment corroded and seriously weakened (2.4.f.1c) 29 July 2008 [14:16] 29/07/2008 631111118250 631111118250
1 Nearside front vehicle structure has excessive corrosion which adversely affects braking or steering (6.1.a.1) Nearside front vehicle structure has excessive corrosion which adversely affects braking or steering (6.1.a.1) 29 July 2008 [14:16] 29/07/2008 631111118250 631111118250
1 Nearside front vehicle structure has excessive corrosion, seriously affecting its strength within 30cm of the body mountings (6.1.b.2) Nearside front vehicle structure has excessive corrosion, seriously affecting its strength within 30cm of the body mountings (6.1.b.2) 29 July 2008 [14:16] 29/07/2008 631111118250 631111118250
1 Offside front vehicle structure has excessive corrosion, seriously affecting its strength within 30cm of the body mountings (6.1.b.2) Offside front vehicle structure has excessive corrosion, seriously affecting its strength within 30cm of the body mountings (6.1.b.2) 29 July 2008 [14:16] 29/07/2008 631111118250 631111118250
1 Nearside body has a sharp edge caused by corrosion (6.1.c.1) Nearside body has a sharp edge caused by corrosion (6.1.c.1) 29 July 2008 [14:16] 29/07/2008 631111118250 631111118250
1 Offside front body has a sharp edge caused by corrosion (6.1.c.1) Offside front body has a sharp edge caused by corrosion (6.1.c.1) 29 July 2008 [14:16] 29/07/2008 631111118250 631111118250
1 Offside front body or chassis has excessive corrosion, seriously affecting its strength within 30cm of the body mountings (6.1.b.2) Offside front body or chassis has excessive corrosion, seriously affecting its strength within 30cm of the body mountings (6.1.b.2) 29 July 2008 [14:16] 29/07/2008 631111118250 631111118250
1 Offside front tyre tread depth below requirements of 1.6mm (4.1.e.1) Offside front tyre tread depth below requirements of 1.6mm (4.1.e.1) 29 July 2008 [14:16] 29/07/2008 631111118250 631111118250
1 Offside rear position lamp(s) incomplete (1.1.4a) Offside rear position lamp(s) incomplete (1.1.4a) 19 June 2007 [16:42] 19/06/2007 433580677164 433580677164
1 Offside rear position lamp(s) incorrect colour (1.1.a.3e) Offside rear position lamp(s) incorrect colour (1.1.a.3e) 19 June 2007 [16:42] 19/06/2007 433580677164 433580677164
1 Direction indicator flashing less than 60 times a minute (1.4.a.2g) Direction indicator flashing less than 60 times a minute (1.4.a.2g) 19 June 2007 [16:42] 19/06/2007 433580677164 433580677164
1 Nearside front position lamp(s) not working (1.1.a.3b) Nearside front position lamp(s) not working (1.1.a.3b) 19 June 2007 [16:42] 19/06/2007 433580677164 433580677164
1 Offside rear suspension spring mounting prescribed area is excessively corroded (2.4.a.3) Offside rear suspension spring mounting prescribed area is excessively corroded (2.4.a.3) 19 June 2007 [16:42] 19/06/2007 433580677164 433580677164
1 Offside front suspension has excessive play in a upper suspension ball joint (2.5.b.1a) Offside front suspension has excessive play in a upper suspension ball joint (2.5.b.1a) 19 June 2007 [16:42] 19/06/2007 433580677164 433580677164
1 Nearside rear parking brake recording little or no effort (3.7.b.6a) Nearside rear parking brake recording little or no effort (3.7.b.6a) 19 June 2007 [16:42] 19/06/2007 433580677164 433580677164
1 Front front position lamp(s) not working (1.1.a.3b) Front front position lamp(s) not working (1.1.a.3b) 13 June 2006 [09:02] 13/06/2006 661414866161 661414866161
1 Nearside rear shock absorber has a serious fluid leak (2.7.3) Nearside rear shock absorber has a serious fluid leak (2.7.3) 13 June 2006 [09:02] 13/06/2006 661414866161 661414866161
1 Offside rear shock absorber has a serious fluid leak (2.7.3) Offside rear shock absorber has a serious fluid leak (2.7.3) 13 June 2006 [09:02] 13/06/2006 661414866161 661414866161
1 Offside front parking brake mechanism/associated mounting prescribed area is excessively corroded (3.1.9) Offside front parking brake mechanism/associated mounting prescribed area is excessively corroded (3.1.9) 13 June 2006 [09:02] 13/06/2006 661414866161 661414866161

ALL LPM 902E User Entered Faults [6]

ALL User Entered faults, ORDERED by OCCURRENCE DURING LPM 902E's MOT HISTORY
ALL LPM 902E User Entered Faults [6]
ALL User Entered faults, ORDERED by OCCURRENCE DURING LPM 902E's MOT HISTORY
Fail Faults | source www.vehiclestats.co.uk
Fault Fault Test Date Test Date/Time Reference MOT Test Reference
1 Boot floor area excessivly corroded but not with in a prescribed area Boot floor area excessivly corroded but not with in a prescribed area 26 February 2009 [13:16] 26/02/2009 612247759061 612247759061
1 Nearside front foot well excessivly corroded and holed Nearside front foot well excessivly corroded and holed 26 February 2009 [13:16] 26/02/2009 612247759061 612247759061
1 Offside front foot well excessivly corroded and holed Offside front foot well excessivly corroded and holed 26 February 2009 [13:16] 26/02/2009 612247759061 612247759061
1 Nearside front wheel arch corroded and holed Nearside front wheel arch corroded and holed 26 February 2009 [13:16] 26/02/2009 612247759061 612247759061
1 Offside front wheel arch corroded and holed Offside front wheel arch corroded and holed 26 February 2009 [13:16] 26/02/2009 612247759061 612247759061
1 Rear box section croded (under boot lid) Rear box section croded (under boot lid) 29 July 2008 [14:16] 29/07/2008 631111118250 631111118250

ALL LPM 902E Pass With Rectification Faults [2]

ALL Pass With Rectification faults, ORDERED by OCCURRENCE DURING LPM 902E's MOT HISTORY
ALL LPM 902E Pass With Rectification Faults [2]
ALL Pass With Rectification faults, ORDERED by OCCURRENCE DURING LPM 902E's MOT HISTORY
Pass With Rectification Faults | source www.vehiclestats.co.uk
Fault Fault Test Date Test Date/Time Reference MOT Test Reference
1 Nearside front position lamp(s) not working (1.1.a.3b) Nearside front position lamp(s) not working (1.1.a.3b) 04 July 2007 [13:42] 04/07/2007 234775787167 234775787167
1 Indicator tell tale inoperative (1.4.a.2a) Indicator tell tale inoperative (1.4.a.2a) 04 July 2007 [13:42] 04/07/2007 234775787167 234775787167

MOT TEST: 26 February 2009 13:16:18 FAILED
MOT TEST: 26 February 2009 13:16:18 FAILED

This test (612247759061) was completed on the 26 February 2009 13:16:18 and FAILED the requirements for a valid MOT with 15 comments.

This test (612247759061) was completed on the 26 February 2009 13:16:18 and FAILED the requirements for a valid MOT with 15 comments.

Recorded mileage: 26,218

Recorded mileage: 26,218


ADVISORY

FAIL

USER ENTERED


MOT TEST: 29 July 2008 14:16:22 FAILED
MOT TEST: 29 July 2008 14:16:22 FAILED

This test (631111118250) was completed on the 29 July 2008 14:16:22 and FAILED the requirements for a valid MOT with 19 comments.

This test (631111118250) was completed on the 29 July 2008 14:16:22 and FAILED the requirements for a valid MOT with 19 comments.

Recorded mileage: 26,171

Recorded mileage: 26,171


ADVISORY

FAIL

USER ENTERED


MOT TEST: 04 July 2007 13:42:08 PASSED
MOT TEST: 04 July 2007 13:42:08 PASSED

This test (633765987107) was completed on the 04 July 2007 13:42:08 and PASSED the requirements for a valid MOT with 0 comments.

This test (633765987107) was completed on the 04 July 2007 13:42:08 and PASSED the requirements for a valid MOT with 0 comments.

Recorded mileage: 22,939

Recorded mileage: 22,939


MOT TEST: 04 July 2007 13:42:08 FAILED
MOT TEST: 04 July 2007 13:42:08 FAILED

This test (234775787167) was completed on the 04 July 2007 13:42:08 and FAILED the requirements for a valid MOT with 2 comments.

This test (234775787167) was completed on the 04 July 2007 13:42:08 and FAILED the requirements for a valid MOT with 2 comments.

Recorded mileage: 22,939

Recorded mileage: 22,939


PASS WITH RECTIFICATION


MOT TEST: 19 June 2007 16:42:59 FAILED
MOT TEST: 19 June 2007 16:42:59 FAILED

This test (433580677164) was completed on the 19 June 2007 16:42:59 and FAILED the requirements for a valid MOT with 9 comments.

This test (433580677164) was completed on the 19 June 2007 16:42:59 and FAILED the requirements for a valid MOT with 9 comments.

Recorded mileage: 22,930

Recorded mileage: 22,930


FAIL


MOT TEST: 16 June 2006 11:47:10 PASSED
MOT TEST: 16 June 2006 11:47:10 PASSED

This test (580667866129) was completed on the 16 June 2006 11:47:10 and PASSED the requirements for a valid MOT with 0 comments.

This test (580667866129) was completed on the 16 June 2006 11:47:10 and PASSED the requirements for a valid MOT with 0 comments.

Recorded mileage: 20,834

Recorded mileage: 20,834


MOT TEST: 13 June 2006 09:02:46 FAILED
MOT TEST: 13 June 2006 09:02:46 FAILED

This test (661414866161) was completed on the 13 June 2006 09:02:46 and FAILED the requirements for a valid MOT with 5 comments.

This test (661414866161) was completed on the 13 June 2006 09:02:46 and FAILED the requirements for a valid MOT with 5 comments.

Recorded mileage: 20,834

Recorded mileage: 20,834


FAIL