LPX 276D


LPX276D is registered to a Blue 1966, Morris Minor with a Petrol engine. It Failed its most recent MOT Test on the 23 June 2011

24 unique faults (25 Total) reported in its MOT History (2 Tests).

0 common/recurring faults.

50% (1) MOT Pass Rate and a 50% (1) MOT Failure Rate.

53,437 recorded miles.

LPX 276D


LPX276D is registered to a Blue 1966, Morris Minor with a Petrol engine. It Failed its most recent MOT Test on the 23 June 2011

24 unique faults (25 Total) reported in its MOT History (2 Tests).

0 common/recurring faults.

50% (1) MOT Pass Rate and a 50% (1) MOT Failure Rate.

53,437 recorded miles.

MOT PASS/Failure rate for LPX 276D

all MOT test results for LPX 276D represented as a percentage
MOT PASS/Failure rate for LPX 276D
all MOT test results for LPX 276D represented as a percentage

PERCENTAGE OF VEHICLE FAULTS WITH LPX 276D

ALL REPORTED FAULTS, DISPLAYED BY PERCENTAGE OF OCCURRENCE DURING ALL MOT TESTS
PERCENTAGE OF VEHICLE FAULTS WITH LPX 276D
ALL REPORTED FAULTS, DISPLAYED BY PERCENTAGE OF OCCURRENCE DURING ALL MOT TESTS
FAIL

LPX 276D annual Faults by type

ALL REPORTED FAULTS, DISPLAYED over time and categorised by type
LPX 276D annual Faults by type
ALL REPORTED FAULTS, DISPLAYED over time and categorised by type

ALL LPX 276D Failure Faults [25]

ALL Failure faults, ORDERED by OCCURRENCE DURING LPX 276D's MOT HISTORY
ALL LPX 276D Failure Faults [25]
ALL Failure faults, ORDERED by OCCURRENCE DURING LPX 276D's MOT HISTORY
Fail Faults | source www.vehiclestats.co.uk
Fault Fault Test Date Test Date/Time Reference MOT Test Reference
1 Offside front position lamp(s) not working (1.1.a.3b) Offside front position lamp(s) not working (1.1.a.3b) 24 March 2011 [10:36] 24/03/2011 809563481062 809563481062
1 Registration plate lamp not working (1.1.c.1d) Registration plate lamp not working (1.1.c.1d) 24 March 2011 [10:36] 24/03/2011 809563481062 809563481062
1 Nearside stop lamp not working (1.2.1b) Nearside stop lamp not working (1.2.1b) 24 March 2011 [10:36] 24/03/2011 809563481062 809563481062
1 Offside stop lamp not working (1.2.1b) Offside stop lamp not working (1.2.1b) 24 March 2011 [10:36] 24/03/2011 809563481062 809563481062
1 Nearside rear direction indicator insecure (1.4.a.2b) Nearside rear direction indicator insecure (1.4.a.2b) 24 March 2011 [10:36] 24/03/2011 809563481062 809563481062
1 Nearside headlamp not working on main beam (1.7.5a) Nearside headlamp not working on main beam (1.7.5a) 24 March 2011 [10:36] 24/03/2011 809563481062 809563481062
1 Offside headlamp not working on main beam (1.7.5a) Offside headlamp not working on main beam (1.7.5a) 24 March 2011 [10:36] 24/03/2011 809563481062 809563481062
1 Offside front suspension component mounting prescribed area is excessively corroded (2.4.a.3) Offside front suspension component mounting prescribed area is excessively corroded (2.4.a.3) 24 March 2011 [10:36] 24/03/2011 809563481062 809563481062
1 Nearside rear suspension component mounting prescribed area is excessively corroded (2.4.a.3) Nearside rear suspension component mounting prescribed area is excessively corroded (2.4.a.3) 24 March 2011 [10:36] 24/03/2011 809563481062 809563481062
1 Nearside front suspension component mounting prescribed area is excessively corroded (2.4.a.3) Nearside front suspension component mounting prescribed area is excessively corroded (2.4.a.3) 24 March 2011 [10:36] 24/03/2011 809563481062 809563481062
1 Offside suspension component mounting prescribed area is excessively corroded (2.4.a.3) Offside suspension component mounting prescribed area is excessively corroded (2.4.a.3) 24 March 2011 [10:36] 24/03/2011 809563481062 809563481062
1 Offside rear brake binding (3.7.b.1) Offside rear brake binding (3.7.b.1) 24 March 2011 [10:36] 24/03/2011 809563481062 809563481062
1 Nearside front tyre has ply or cords exposed (4.1.d.1b) Nearside front tyre has ply or cords exposed (4.1.d.1b) 24 March 2011 [10:36] 24/03/2011 809563481062 809563481062
1 Offside front tyre has ply or cords exposed (4.1.d.1b) Offside front tyre has ply or cords exposed (4.1.d.1b) 24 March 2011 [10:36] 24/03/2011 809563481062 809563481062
1 Nearside rear tyre has ply or cords exposed (4.1.d.1b) Nearside rear tyre has ply or cords exposed (4.1.d.1b) 24 March 2011 [10:36] 24/03/2011 809563481062 809563481062
1 Offside rear tyre has ply or cords exposed (4.1.d.1b) Offside rear tyre has ply or cords exposed (4.1.d.1b) 24 March 2011 [10:36] 24/03/2011 809563481062 809563481062
1 Nearside front brake recording little or no effort (3.7.b.5a) Nearside front brake recording little or no effort (3.7.b.5a) 24 March 2011 [10:36] 24/03/2011 809563481062 809563481062
1 Offside front brake recording little or no effort (3.7.b.5a) Offside front brake recording little or no effort (3.7.b.5a) 24 March 2011 [10:36] 24/03/2011 809563481062 809563481062
1 Nearside rear brake recording little or no effort (3.7.b.5a) Nearside rear brake recording little or no effort (3.7.b.5a) 24 March 2011 [10:36] 24/03/2011 809563481062 809563481062
1 Offside rear brake recording little or no effort (3.7.b.5a) Offside rear brake recording little or no effort (3.7.b.5a) 24 March 2011 [10:36] 24/03/2011 809563481062 809563481062
1 Nearside rear parking brake recording little or no effort (3.7.b.6a) Nearside rear parking brake recording little or no effort (3.7.b.6a) 24 March 2011 [10:36] 24/03/2011 809563481062 809563481062
1 Offside rear parking brake recording little or no effort (3.7.b.6a) Offside rear parking brake recording little or no effort (3.7.b.6a) 24 March 2011 [10:36] 24/03/2011 809563481062 809563481062
1 Service brake: efficiency below requirements (3.7.b.7) Service brake: efficiency below requirements (3.7.b.7) 24 March 2011 [10:36] 24/03/2011 809563481062 809563481062
1 Parking brake: efficiency below requirements (3.7.b.7) Parking brake: efficiency below requirements (3.7.b.7) 24 March 2011 [10:36] 24/03/2011 809563481062 809563481062

MOT TEST: 23 June 2011 11:48:14 PASSED
MOT TEST: 23 June 2011 11:48:14 PASSED

This test (859804671143) was completed on the 23 June 2011 11:48:14 and PASSED the requirements for a valid MOT with 0 comments.

This test (859804671143) was completed on the 23 June 2011 11:48:14 and PASSED the requirements for a valid MOT with 0 comments.

Recorded mileage: 53,437

Recorded mileage: 53,437


MOT TEST: 24 March 2011 10:36:52 FAILED
MOT TEST: 24 March 2011 10:36:52 FAILED

This test (809563481062) was completed on the 24 March 2011 10:36:52 and FAILED the requirements for a valid MOT with 25 comments.

This test (809563481062) was completed on the 24 March 2011 10:36:52 and FAILED the requirements for a valid MOT with 25 comments.

Recorded mileage: 53,436

Recorded mileage: 53,436


FAIL