LVG 388B


LVG388B is registered to a Black 1971, Morris Minor with a Petrol engine. It Failed its most recent MOT Test on the 08 August 2017

29 unique faults (33 Total) reported in its MOT History (8 Tests).

3 common/recurring faults, the most frequent (3 times) is: Service brake: efficiency below requirements (3.7.B.7).

50% (4) MOT Pass Rate and a 50% (4) MOT Failure Rate.

29,408 recorded miles.

LVG 388B


LVG388B is registered to a Black 1971, Morris Minor with a Petrol engine. It Failed its most recent MOT Test on the 08 August 2017

29 unique faults (33 Total) reported in its MOT History (8 Tests).

3 common/recurring faults, the most frequent (3 times) is: Service brake: efficiency below requirements (3.7.B.7).

50% (4) MOT Pass Rate and a 50% (4) MOT Failure Rate.

29,408 recorded miles.

MOT PASS/Failure rate for LVG 388B

all MOT test results for LVG 388B represented as a percentage
MOT PASS/Failure rate for LVG 388B
all MOT test results for LVG 388B represented as a percentage

PERCENTAGE OF VEHICLE FAULTS WITH LVG 388B

ALL REPORTED FAULTS, DISPLAYED BY PERCENTAGE OF OCCURRENCE DURING ALL MOT TESTS
PERCENTAGE OF VEHICLE FAULTS WITH LVG 388B
ALL REPORTED FAULTS, DISPLAYED BY PERCENTAGE OF OCCURRENCE DURING ALL MOT TESTS
ADVISORY

FAIL

LVG 388B annual Faults by type

ALL REPORTED FAULTS, DISPLAYED over time and categorised by type
LVG 388B annual Faults by type
ALL REPORTED FAULTS, DISPLAYED over time and categorised by type

RECURRING FAULTS WITH LVG 388B

FAULTS THAT HAVE OCCURED MORE THAN ONCE DURING LVG 388B's MOT HISTORY
RECURRING FAULTS WITH LVG 388B
FAULTS THAT HAVE OCCURED MORE THAN ONCE DURING LVG 388B's MOT HISTORY
Fault Fault Test Date Test Date/Time Reference MOT Test Reference
3 Service brake: efficiency below requirements (3.7.b.7) Service brake: efficiency below requirements (3.7.b.7) 27 July 2017 [15:33] 27/07/2017 12 January 2010 [09:45] 12/01/2010 16 October 2009 [16:05] 16/10/2009 955334192379 955334192379 123942810060 123942810060 304079489297 304079489297
2 Offside front upper suspension arm rubber bush deteriorated but not resulting in excessive movement (2.4.g.2) Offside front upper suspension arm rubber bush deteriorated but not resulting in excessive movement (2.4.g.2) 22 August 2014 [14:42] 22/08/2014 18 August 2014 [09:33] 18/08/2014 285844734227 285844734227 388130834406 388130834406
2 Windscreen washer provides insufficient washer liquid (8.2.3) Windscreen washer provides insufficient washer liquid (8.2.3) 12 January 2010 [09:45] 12/01/2010 16 October 2009 [16:05] 16/10/2009 123942810060 123942810060 304079489297 304079489297

ALL LVG 388B ADVISORIES [2]

ALL ADVISORIES, ORDERED by OCCURRENCE DURING LVG 388B's MOT HISTORY
ALL LVG 388B ADVISORIES [2]
ALL ADVISORIES, ORDERED by OCCURRENCE DURING LVG 388B's MOT HISTORY
Advisory Faults | source www.vehiclestats.co.uk
Fault Fault Test Date Test Date/Time Reference MOT Test Reference
2 Offside front upper suspension arm rubber bush deteriorated but not resulting in excessive movement (2.4.g.2) Offside front upper suspension arm rubber bush deteriorated but not resulting in excessive movement (2.4.g.2) 22 August 2014 [14:42] 22/08/2014 18 August 2014 [09:33] 18/08/2014 285844734227 285844734227 388130834406 388130834406

ALL LVG 388B Failure Faults [31]

ALL Failure faults, ORDERED by OCCURRENCE DURING LVG 388B's MOT HISTORY
ALL LVG 388B Failure Faults [31]
ALL Failure faults, ORDERED by OCCURRENCE DURING LVG 388B's MOT HISTORY
Fail Faults | source www.vehiclestats.co.uk
Fault Fault Test Date Test Date/Time Reference MOT Test Reference
3 Service brake: efficiency below requirements (3.7.b.7) Service brake: efficiency below requirements (3.7.b.7) 27 July 2017 [15:33] 27/07/2017 12 January 2010 [09:45] 12/01/2010 16 October 2009 [16:05] 16/10/2009 955334192379 955334192379 123942810060 123942810060 304079489297 304079489297
2 Windscreen washer provides insufficient washer liquid (8.2.3) Windscreen washer provides insufficient washer liquid (8.2.3) 12 January 2010 [09:45] 12/01/2010 16 October 2009 [16:05] 16/10/2009 123942810060 123942810060 304079489297 304079489297
1 Front brakes imbalanced across an axle (3.7.b.5b) Front brakes imbalanced across an axle (3.7.b.5b) 27 July 2017 [15:33] 27/07/2017 955334192379 955334192379
1 Offside front front brake recording little or no effort (3.7.b.5a) Offside front front brake recording little or no effort (3.7.b.5a) 27 July 2017 [15:33] 27/07/2017 955334192379 955334192379
1 Offside obligatory mirror missing (8.1.1) Offside obligatory mirror missing (8.1.1) 27 July 2017 [15:33] 27/07/2017 955334192379 955334192379
1 Offside front steering retaining device missing (2.2.c.1g) Offside front steering retaining device missing (2.2.c.1g) 18 August 2014 [09:33] 18/08/2014 388130834406 388130834406
1 Nearside steering rack gaiter split (2.2.d.2d) Nearside steering rack gaiter split (2.2.d.2d) 18 August 2014 [09:33] 18/08/2014 388130834406 388130834406
1 Nearside windscreen washer provides insufficient washer liquid (8.2.3) Nearside windscreen washer provides insufficient washer liquid (8.2.3) 18 August 2014 [09:33] 18/08/2014 388130834406 388130834406
1 Offside windscreen washer provides insufficient washer liquid (8.2.3) Offside windscreen washer provides insufficient washer liquid (8.2.3) 18 August 2014 [09:33] 18/08/2014 388130834406 388130834406
1 Nearside front upper shock absorber has an excessively worn shock absorber pivot (2.7.4) Nearside front upper shock absorber has an excessively worn shock absorber pivot (2.7.4) 12 January 2010 [09:45] 12/01/2010 123942810060 123942810060
1 Offside front upper shock absorber has an excessively worn shock absorber pivot (2.7.4) Offside front upper shock absorber has an excessively worn shock absorber pivot (2.7.4) 12 January 2010 [09:45] 12/01/2010 123942810060 123942810060
1 Offside front front suspension has excessive play in a lower suspension ball joint (2.5.b.1a) Offside front front suspension has excessive play in a lower suspension ball joint (2.5.b.1a) 12 January 2010 [09:45] 12/01/2010 123942810060 123942810060
1 Brake pedal creeps down when held under pressure (3.3.b.1a) Brake pedal creeps down when held under pressure (3.3.b.1a) 12 January 2010 [09:45] 12/01/2010 123942810060 123942810060
1 Nearside front front brake binding (3.7.b.1) Nearside front front brake binding (3.7.b.1) 12 January 2010 [09:45] 12/01/2010 123942810060 123942810060
1 Nearside rear front brake binding (3.7.b.1) Nearside rear front brake binding (3.7.b.1) 12 January 2010 [09:45] 12/01/2010 123942810060 123942810060
1 Offside rear front brake binding (3.7.b.1) Offside rear front brake binding (3.7.b.1) 12 January 2010 [09:45] 12/01/2010 123942810060 123942810060
1 Brake linkage has abnormal movement of levers indicating maladjustment (3.5.1f) Brake linkage has abnormal movement of levers indicating maladjustment (3.5.1f) 12 January 2010 [09:45] 12/01/2010 123942810060 123942810060
1 Nearside front upper suspension arm has excessive play in a pin/bush (2.4.g.2) Nearside front upper suspension arm has excessive play in a pin/bush (2.4.g.2) 16 October 2009 [16:05] 16/10/2009 304079489297 304079489297
1 Offside front body or chassis has excessive corrosion, seriously affecting its strength within 30cm of the body mountings (6.1.b.2) Offside front body or chassis has excessive corrosion, seriously affecting its strength within 30cm of the body mountings (6.1.b.2) 16 October 2009 [16:05] 16/10/2009 304079489297 304079489297
1 Nearside rear wheel nut(s) missing (4.2.a.1e) Nearside rear wheel nut(s) missing (4.2.a.1e) 16 October 2009 [16:05] 16/10/2009 304079489297 304079489297
1 Horn not working (1.6.2a) Horn not working (1.6.2a) 16 October 2009 [16:05] 16/10/2009 304079489297 304079489297
1 Nearside front front position lamp(s) not working (1.1.a.3b) Nearside front front position lamp(s) not working (1.1.a.3b) 16 October 2009 [16:05] 16/10/2009 304079489297 304079489297
1 Offside front front position lamp(s) not working (1.1.a.3b) Offside front front position lamp(s) not working (1.1.a.3b) 16 October 2009 [16:05] 16/10/2009 304079489297 304079489297
1 Nearside front mechanical brake component has restricted free movement (3.5.1k) Nearside front mechanical brake component has restricted free movement (3.5.1k) 16 October 2009 [16:05] 16/10/2009 304079489297 304079489297
1 Nearside rear mechanical brake component has restricted free movement (3.5.1k) Nearside rear mechanical brake component has restricted free movement (3.5.1k) 16 October 2009 [16:05] 16/10/2009 304079489297 304079489297
1 Offside rear mechanical brake component has restricted free movement (3.5.1k) Offside rear mechanical brake component has restricted free movement (3.5.1k) 16 October 2009 [16:05] 16/10/2009 304079489297 304079489297
1 Parking brake: efficiency below requirements (3.7.b.7) Parking brake: efficiency below requirements (3.7.b.7) 16 October 2009 [16:05] 16/10/2009 304079489297 304079489297
1 Brakes imbalanced across an axle (3.7.b.5b) Brakes imbalanced across an axle (3.7.b.5b) 16 October 2009 [16:05] 16/10/2009 304079489297 304079489297

MOT TEST: 08 August 2017 13:20:05 PASSED
MOT TEST: 08 August 2017 13:20:05 PASSED

This test (490178964767) was completed on the 08 August 2017 13:20:05 and PASSED the requirements for a valid MOT with 0 comments.

This test (490178964767) was completed on the 08 August 2017 13:20:05 and PASSED the requirements for a valid MOT with 0 comments.

Recorded mileage: 29,408

Recorded mileage: 29,408


MOT TEST: 27 July 2017 15:33:09 FAILED
MOT TEST: 27 July 2017 15:33:09 FAILED

This test (955334192379) was completed on the 27 July 2017 15:33:09 and FAILED the requirements for a valid MOT with 4 comments.

This test (955334192379) was completed on the 27 July 2017 15:33:09 and FAILED the requirements for a valid MOT with 4 comments.

Recorded mileage: 29,393

Recorded mileage: 29,393


FAIL


MOT TEST: 03 September 2015 09:49:02 PASSED
MOT TEST: 03 September 2015 09:49:02 PASSED

This test (591051488469) was completed on the 03 September 2015 09:49:02 and PASSED the requirements for a valid MOT with 0 comments.

This test (591051488469) was completed on the 03 September 2015 09:49:02 and PASSED the requirements for a valid MOT with 0 comments.

Recorded mileage: 29,346

Recorded mileage: 29,346


MOT TEST: 22 August 2014 14:42:40 PASSED
MOT TEST: 22 August 2014 14:42:40 PASSED

This test (285844734227) was completed on the 22 August 2014 14:42:40 and PASSED the requirements for a valid MOT with 1 comments.

This test (285844734227) was completed on the 22 August 2014 14:42:40 and PASSED the requirements for a valid MOT with 1 comments.

Recorded mileage: 29,211

Recorded mileage: 29,211


ADVISORY


MOT TEST: 18 August 2014 09:33:02 FAILED
MOT TEST: 18 August 2014 09:33:02 FAILED

This test (388130834406) was completed on the 18 August 2014 09:33:02 and FAILED the requirements for a valid MOT with 5 comments.

This test (388130834406) was completed on the 18 August 2014 09:33:02 and FAILED the requirements for a valid MOT with 5 comments.

Recorded mileage: 29,211

Recorded mileage: 29,211


ADVISORY

FAIL


MOT TEST: 17 May 2013 09:58:01 PASSED
MOT TEST: 17 May 2013 09:58:01 PASSED

This test (867417733178) was completed on the 17 May 2013 09:58:01 and PASSED the requirements for a valid MOT with 0 comments.

This test (867417733178) was completed on the 17 May 2013 09:58:01 and PASSED the requirements for a valid MOT with 0 comments.

Recorded mileage: 28,830

Recorded mileage: 28,830


MOT TEST: 12 January 2010 09:45:51 FAILED
MOT TEST: 12 January 2010 09:45:51 FAILED

This test (123942810060) was completed on the 12 January 2010 09:45:51 and FAILED the requirements for a valid MOT with 10 comments.

This test (123942810060) was completed on the 12 January 2010 09:45:51 and FAILED the requirements for a valid MOT with 10 comments.

Recorded mileage: 25,129

Recorded mileage: 25,129


FAIL


MOT TEST: 16 October 2009 16:05:21 FAILED
MOT TEST: 16 October 2009 16:05:21 FAILED

This test (304079489297) was completed on the 16 October 2009 16:05:21 and FAILED the requirements for a valid MOT with 13 comments.

This test (304079489297) was completed on the 16 October 2009 16:05:21 and FAILED the requirements for a valid MOT with 13 comments.

Recorded mileage: 25,112

Recorded mileage: 25,112


FAIL