SFL29


SFL29 is registered to a Grey 1963, Morris Minor estate with a Petrol engine. It Failed its most recent MOT Test on the 02 October 2017

9 unique faults (9 Total) reported in its MOT History (3 Tests).

0 common/recurring faults.

67% (2) MOT Pass Rate and a 33% (1) MOT Failure Rate.

72,885 recorded miles.

SFL29


SFL29 is registered to a Grey 1963, Morris Minor estate with a Petrol engine. It Failed its most recent MOT Test on the 02 October 2017

9 unique faults (9 Total) reported in its MOT History (3 Tests).

0 common/recurring faults.

67% (2) MOT Pass Rate and a 33% (1) MOT Failure Rate.

72,885 recorded miles.

MOT PASS/Failure rate for SFL29

all MOT test results for SFL29 represented as a percentage
MOT PASS/Failure rate for SFL29
all MOT test results for SFL29 represented as a percentage

PERCENTAGE OF VEHICLE FAULTS WITH SFL29

ALL REPORTED FAULTS, DISPLAYED BY PERCENTAGE OF OCCURRENCE DURING ALL MOT TESTS
PERCENTAGE OF VEHICLE FAULTS WITH SFL29
ALL REPORTED FAULTS, DISPLAYED BY PERCENTAGE OF OCCURRENCE DURING ALL MOT TESTS
ADVISORY

FAIL

SFL29 annual Faults by type

ALL REPORTED FAULTS, DISPLAYED over time and categorised by type
SFL29 annual Faults by type
ALL REPORTED FAULTS, DISPLAYED over time and categorised by type

ALL SFL29 ADVISORIES [2]

ALL ADVISORIES, ORDERED by OCCURRENCE DURING SFL29's MOT HISTORY
ALL SFL29 ADVISORIES [2]
ALL ADVISORIES, ORDERED by OCCURRENCE DURING SFL29's MOT HISTORY
Advisory Faults | source www.vehiclestats.co.uk
Fault Fault Test Date Test Date/Time Reference MOT Test Reference
1 155/80/r14/81t. Fronts 6mm. Rears 3mm. 155/80/r14/81t. Fronts 6mm. Rears 3mm. 02 October 2017 [08:58] 02/10/2017 999338679074 999338679074
1 155/8/0/r14/81t. Of 6 or 2.5 nr 4 nf 6mm. 155/8/0/r14/81t. Of 6 or 2.5 nr 4 nf 6mm. 30 June 2016 [10:43] 30/06/2016 865948518060 865948518060

ALL SFL29 Failure Faults [7]

ALL Failure faults, ORDERED by OCCURRENCE DURING SFL29's MOT HISTORY
ALL SFL29 Failure Faults [7]
ALL Failure faults, ORDERED by OCCURRENCE DURING SFL29's MOT HISTORY
Fail Faults | source www.vehiclestats.co.uk
Fault Fault Test Date Test Date/Time Reference MOT Test Reference
1 Nearside front direction indicator not working (1.4.a.2c) Nearside front direction indicator not working (1.4.a.2c) 30 June 2016 [10:43] 30/06/2016 865948518060 865948518060
1 Nearside headlamp not working on dipped beam (1.7.5a) Nearside headlamp not working on dipped beam (1.7.5a) 30 June 2016 [10:43] 30/06/2016 865948518060 865948518060
1 Nearside headlamp aim beam image obviously incorrect (1.8.a.1b) Nearside headlamp aim beam image obviously incorrect (1.8.a.1b) 30 June 2016 [10:43] 30/06/2016 865948518060 865948518060
1 Offside headlamp aim beam image obviously incorrect (1.8.a.1b) Offside headlamp aim beam image obviously incorrect (1.8.a.1b) 30 June 2016 [10:43] 30/06/2016 865948518060 865948518060
1 Offside front vehicle structure has excessive corrosion, seriously affecting its strength within 30cm of the body mountings (6.1.b.2) Offside front vehicle structure has excessive corrosion, seriously affecting its strength within 30cm of the body mountings (6.1.b.2) 30 June 2016 [10:43] 30/06/2016 865948518060 865948518060
1 Nearside front vehicle structure has an unsatisfactory modification, seriously affecting its strength within 30cm of the body mountings (6.1.b.2) Nearside front vehicle structure has an unsatisfactory modification, seriously affecting its strength within 30cm of the body mountings (6.1.b.2) 30 June 2016 [10:43] 30/06/2016 865948518060 865948518060
1 Nearside vehicle structure has an unsatisfactory modification, seriously affecting its strength within 30cm of the body mountings (6.1.b.2) Nearside vehicle structure has an unsatisfactory modification, seriously affecting its strength within 30cm of the body mountings (6.1.b.2) 30 June 2016 [10:43] 30/06/2016 865948518060 865948518060

MOT TEST: 02 October 2017 08:58:38 PASSED
MOT TEST: 02 October 2017 08:58:38 PASSED

This test (999338679074) was completed on the 02 October 2017 08:58:38 and PASSED the requirements for a valid MOT with 1 comments.

This test (999338679074) was completed on the 02 October 2017 08:58:38 and PASSED the requirements for a valid MOT with 1 comments.

Recorded mileage: 72,885

Recorded mileage: 72,885


ADVISORY


MOT TEST: 07 September 2016 16:35:17 PASSED
MOT TEST: 07 September 2016 16:35:17 PASSED

This test (142129623765) was completed on the 07 September 2016 16:35:17 and PASSED the requirements for a valid MOT with 0 comments.

This test (142129623765) was completed on the 07 September 2016 16:35:17 and PASSED the requirements for a valid MOT with 0 comments.

Recorded mileage: 72,600

Recorded mileage: 72,600


MOT TEST: 30 June 2016 10:43:32 FAILED
MOT TEST: 30 June 2016 10:43:32 FAILED

This test (865948518060) was completed on the 30 June 2016 10:43:32 and FAILED the requirements for a valid MOT with 8 comments.

This test (865948518060) was completed on the 30 June 2016 10:43:32 and FAILED the requirements for a valid MOT with 8 comments.

Recorded mileage: 72,598

Recorded mileage: 72,598


ADVISORY

FAIL