SSO 126M


SSO126M is registered to a White 1973, Morris Mini 1000 with a Petrol engine. It Failed its most recent MOT Test on the 15 June 2017

16 unique faults (20 Total) reported in its MOT History (8 Tests).

4 common/recurring faults, the most frequent (2 times) is: Offside Front Upper Suspension arm has slight play in a ball joint (2.4.G.2).

75% (6) MOT Pass Rate and a 25% (2) MOT Failure Rate.

64,857 recorded miles.

SSO 126M


SSO126M is registered to a White 1973, Morris Mini 1000 with a Petrol engine. It Failed its most recent MOT Test on the 15 June 2017

16 unique faults (20 Total) reported in its MOT History (8 Tests).

4 common/recurring faults, the most frequent (2 times) is: Offside Front Upper Suspension arm has slight play in a ball joint (2.4.G.2).

75% (6) MOT Pass Rate and a 25% (2) MOT Failure Rate.

64,857 recorded miles.

MOT PASS/Failure rate for SSO 126M

all MOT test results for SSO 126M represented as a percentage
MOT PASS/Failure rate for SSO 126M
all MOT test results for SSO 126M represented as a percentage

PERCENTAGE OF VEHICLE FAULTS WITH SSO 126M

ALL REPORTED FAULTS, DISPLAYED BY PERCENTAGE OF OCCURRENCE DURING ALL MOT TESTS
PERCENTAGE OF VEHICLE FAULTS WITH SSO 126M
ALL REPORTED FAULTS, DISPLAYED BY PERCENTAGE OF OCCURRENCE DURING ALL MOT TESTS
ADVISORY

FAIL

PASS WITH RECTIFICATION

SSO 126M annual Faults by type

ALL REPORTED FAULTS, DISPLAYED over time and categorised by type
SSO 126M annual Faults by type
ALL REPORTED FAULTS, DISPLAYED over time and categorised by type

RECURRING FAULTS WITH SSO 126M

FAULTS THAT HAVE OCCURED MORE THAN ONCE DURING SSO 126M's MOT HISTORY
RECURRING FAULTS WITH SSO 126M
FAULTS THAT HAVE OCCURED MORE THAN ONCE DURING SSO 126M's MOT HISTORY
Fault Fault Test Date Test Date/Time Reference MOT Test Reference
2 Offside front upper suspension arm has slight play in a ball joint (2.4.g.2) Offside front upper suspension arm has slight play in a ball joint (2.4.g.2) 04 January 2011 [16:38] 04/01/2011 04 January 2011 [16:38] 04/01/2011 267474201078 267474201078 619414501092 619414501092
2 Nearside rear rear wheel bearing has slight play (2.6.2) Nearside rear rear wheel bearing has slight play (2.6.2) 04 January 2011 [16:38] 04/01/2011 04 January 2011 [16:38] 04/01/2011 267474201078 267474201078 619414501092 619414501092
2 Offside rear rear wheel bearing has slight play (2.6.2) Offside rear rear wheel bearing has slight play (2.6.2) 04 January 2011 [16:38] 04/01/2011 04 January 2011 [16:38] 04/01/2011 267474201078 267474201078 619414501092 619414501092
2 Offside front wheel bearing has slight play (2.5.a.3c) Offside front wheel bearing has slight play (2.5.a.3c) 04 January 2011 [16:38] 04/01/2011 04 January 2011 [16:38] 04/01/2011 267474201078 267474201078 619414501092 619414501092

ALL SSO 126M ADVISORIES [13]

ALL ADVISORIES, ORDERED by OCCURRENCE DURING SSO 126M's MOT HISTORY
ALL SSO 126M ADVISORIES [13]
ALL ADVISORIES, ORDERED by OCCURRENCE DURING SSO 126M's MOT HISTORY
Advisory Faults | source www.vehiclestats.co.uk
Fault Fault Test Date Test Date/Time Reference MOT Test Reference
2 Offside front upper suspension arm has slight play in a ball joint (2.4.g.2) Offside front upper suspension arm has slight play in a ball joint (2.4.g.2) 04 January 2011 [16:38] 04/01/2011 04 January 2011 [16:38] 04/01/2011 267474201078 267474201078 619414501092 619414501092
2 Nearside rear rear wheel bearing has slight play (2.6.2) Nearside rear rear wheel bearing has slight play (2.6.2) 04 January 2011 [16:38] 04/01/2011 04 January 2011 [16:38] 04/01/2011 267474201078 267474201078 619414501092 619414501092
2 Offside rear rear wheel bearing has slight play (2.6.2) Offside rear rear wheel bearing has slight play (2.6.2) 04 January 2011 [16:38] 04/01/2011 04 January 2011 [16:38] 04/01/2011 267474201078 267474201078 619414501092 619414501092
2 Offside front wheel bearing has slight play (2.5.a.3c) Offside front wheel bearing has slight play (2.5.a.3c) 04 January 2011 [16:38] 04/01/2011 04 January 2011 [16:38] 04/01/2011 267474201078 267474201078 619414501092 619414501092
1 Nearside rear brake hose has slight corrosion to ferrules (3.6.b.4e) Nearside rear brake hose has slight corrosion to ferrules (3.6.b.4e) 07 July 2012 [13:25] 07/07/2012 296739682196 296739682196
1 Offside rear brake hose has slight corrosion to ferrules (3.6.b.4e) Offside rear brake hose has slight corrosion to ferrules (3.6.b.4e) 07 July 2012 [13:25] 07/07/2012 296739682196 296739682196
1 Offside rear tyre worn close to the legal limit (4.1.e.1) Offside rear tyre worn close to the legal limit (4.1.e.1) 07 July 2012 [13:25] 07/07/2012 296739682196 296739682196
1 Service brake: service brake efficiency only just met. It would appear that the braking system requires adjustment or repair. (3.7.c.1a) Service brake: service brake efficiency only just met. It would appear that the braking system requires adjustment or repair. (3.7.c.1a) 07 July 2012 [13:25] 07/07/2012 296739682196 296739682196
1 Parking brake: parking brake efficiency only just met. It would appear that the braking system requires adjustment or repair. (3.7.c.1b) Parking brake: parking brake efficiency only just met. It would appear that the braking system requires adjustment or repair. (3.7.c.1b) 07 July 2012 [13:25] 07/07/2012 296739682196 296739682196

ALL SSO 126M Failure Faults [3]

ALL Failure faults, ORDERED by OCCURRENCE DURING SSO 126M's MOT HISTORY
ALL SSO 126M Failure Faults [3]
ALL Failure faults, ORDERED by OCCURRENCE DURING SSO 126M's MOT HISTORY
Fail Faults | source www.vehiclestats.co.uk
Fault Fault Test Date Test Date/Time Reference MOT Test Reference
1 Brake pedal anti-slip provision missing (3.3.a.1b) Brake pedal anti-slip provision missing (3.3.a.1b) 16 January 2010 [12:03] 16/01/2010 883026110092 883026110092
1 Brake pedal creeps down while the pedal is held under pressure (3.3.b.1a) Brake pedal creeps down while the pedal is held under pressure (3.3.b.1a) 16 January 2010 [12:03] 16/01/2010 883026110092 883026110092
1 Service brake: efficiency below requirements (3.7.b.7) Service brake: efficiency below requirements (3.7.b.7) 16 January 2010 [12:03] 16/01/2010 883026110092 883026110092

ALL SSO 126M Pass With Rectification Faults [4]

ALL Pass With Rectification faults, ORDERED by OCCURRENCE DURING SSO 126M's MOT HISTORY
ALL SSO 126M Pass With Rectification Faults [4]
ALL Pass With Rectification faults, ORDERED by OCCURRENCE DURING SSO 126M's MOT HISTORY
Pass With Rectification Faults | source www.vehiclestats.co.uk
Fault Fault Test Date Test Date/Time Reference MOT Test Reference
1 Nearside front tyre not fitted in accordance with side wall instructions (4.1.d.1f) Nearside front tyre not fitted in accordance with side wall instructions (4.1.d.1f) 04 January 2011 [16:38] 04/01/2011 619414501092 619414501092
1 Offside front tyre not fitted in accordance with side wall instructions (4.1.d.1f) Offside front tyre not fitted in accordance with side wall instructions (4.1.d.1f) 04 January 2011 [16:38] 04/01/2011 619414501092 619414501092
1 Nearside rear tyre not fitted in accordance with side wall instructions (4.1.d.1f) Nearside rear tyre not fitted in accordance with side wall instructions (4.1.d.1f) 04 January 2011 [16:38] 04/01/2011 619414501092 619414501092
1 Offside rear tyre not fitted in accordance with side wall instructions (4.1.d.1f) Offside rear tyre not fitted in accordance with side wall instructions (4.1.d.1f) 04 January 2011 [16:38] 04/01/2011 619414501092 619414501092

MOT TEST: 15 June 2017 15:07:19 PASSED
MOT TEST: 15 June 2017 15:07:19 PASSED

This test (281323452655) was completed on the 15 June 2017 15:07:19 and PASSED the requirements for a valid MOT with 0 comments.

This test (281323452655) was completed on the 15 June 2017 15:07:19 and PASSED the requirements for a valid MOT with 0 comments.

Recorded mileage: 52,956

Recorded mileage: 52,956


MOT TEST: 21 April 2016 13:39:44 PASSED
MOT TEST: 21 April 2016 13:39:44 PASSED

This test (507076625242) was completed on the 21 April 2016 13:39:44 and PASSED the requirements for a valid MOT with 0 comments.

This test (507076625242) was completed on the 21 April 2016 13:39:44 and PASSED the requirements for a valid MOT with 0 comments.

Recorded mileage: 52,892

Recorded mileage: 52,892


MOT TEST: 24 July 2014 15:11:53 PASSED
MOT TEST: 24 July 2014 15:11:53 PASSED

This test (295665804250) was completed on the 24 July 2014 15:11:53 and PASSED the requirements for a valid MOT with 0 comments.

This test (295665804250) was completed on the 24 July 2014 15:11:53 and PASSED the requirements for a valid MOT with 0 comments.

Recorded mileage: 52,081

Recorded mileage: 52,081


MOT TEST: 07 July 2012 13:25:06 PASSED
MOT TEST: 07 July 2012 13:25:06 PASSED

This test (296739682196) was completed on the 07 July 2012 13:25:06 and PASSED the requirements for a valid MOT with 5 comments.

This test (296739682196) was completed on the 07 July 2012 13:25:06 and PASSED the requirements for a valid MOT with 5 comments.

Recorded mileage: 51,146

Recorded mileage: 51,146


ADVISORY


MOT TEST: 04 January 2011 16:38:59 PASSED
MOT TEST: 04 January 2011 16:38:59 PASSED

This test (267474201078) was completed on the 04 January 2011 16:38:59 and PASSED the requirements for a valid MOT with 4 comments.

This test (267474201078) was completed on the 04 January 2011 16:38:59 and PASSED the requirements for a valid MOT with 4 comments.

Recorded mileage: 49,499

Recorded mileage: 49,499


ADVISORY


MOT TEST: 04 January 2011 16:38:59 FAILED
MOT TEST: 04 January 2011 16:38:59 FAILED

This test (619414501092) was completed on the 04 January 2011 16:38:59 and FAILED the requirements for a valid MOT with 8 comments.

This test (619414501092) was completed on the 04 January 2011 16:38:59 and FAILED the requirements for a valid MOT with 8 comments.

Recorded mileage: 49,499

Recorded mileage: 49,499


ADVISORY

PASS WITH RECTIFICATION


MOT TEST: 18 January 2010 16:39:49 PASSED
MOT TEST: 18 January 2010 16:39:49 PASSED

This test (120568510002) was completed on the 18 January 2010 16:39:49 and PASSED the requirements for a valid MOT with 0 comments.

This test (120568510002) was completed on the 18 January 2010 16:39:49 and PASSED the requirements for a valid MOT with 0 comments.

Recorded mileage: 64,857

Recorded mileage: 64,857


MOT TEST: 16 January 2010 12:03:49 FAILED
MOT TEST: 16 January 2010 12:03:49 FAILED

This test (883026110092) was completed on the 16 January 2010 12:03:49 and FAILED the requirements for a valid MOT with 3 comments.

This test (883026110092) was completed on the 16 January 2010 12:03:49 and FAILED the requirements for a valid MOT with 3 comments.

Recorded mileage: 64,846

Recorded mileage: 64,846


FAIL