XGJ 779W


XGJ779W is registered to a Brown 1981, Morris Ital hl with a Petrol engine. It Failed its most recent MOT Test on the 07 June 2007

6 unique faults (6 Total) reported in its MOT History (3 Tests).

0 common/recurring faults.

67% (2) MOT Pass Rate and a 33% (1) MOT Failure Rate.

70,369 recorded miles.

XGJ 779W


XGJ779W is registered to a Brown 1981, Morris Ital hl with a Petrol engine. It Failed its most recent MOT Test on the 07 June 2007

6 unique faults (6 Total) reported in its MOT History (3 Tests).

0 common/recurring faults.

67% (2) MOT Pass Rate and a 33% (1) MOT Failure Rate.

70,369 recorded miles.

MOT PASS/Failure rate for XGJ 779W

all MOT test results for XGJ 779W represented as a percentage
MOT PASS/Failure rate for XGJ 779W
all MOT test results for XGJ 779W represented as a percentage

PERCENTAGE OF VEHICLE FAULTS WITH XGJ 779W

ALL REPORTED FAULTS, DISPLAYED BY PERCENTAGE OF OCCURRENCE DURING ALL MOT TESTS
PERCENTAGE OF VEHICLE FAULTS WITH XGJ 779W
ALL REPORTED FAULTS, DISPLAYED BY PERCENTAGE OF OCCURRENCE DURING ALL MOT TESTS
ADVISORY

FAIL

USER ENTERED

XGJ 779W annual Faults by type

ALL REPORTED FAULTS, DISPLAYED over time and categorised by type
XGJ 779W annual Faults by type
ALL REPORTED FAULTS, DISPLAYED over time and categorised by type

ALL XGJ 779W ADVISORIES [1]

ALL ADVISORIES, ORDERED by OCCURRENCE DURING XGJ 779W's MOT HISTORY
ALL XGJ 779W ADVISORIES [1]
ALL ADVISORIES, ORDERED by OCCURRENCE DURING XGJ 779W's MOT HISTORY
Fail Faults | source www.vehiclestats.co.uk
Fault Fault Test Date Test Date/Time Reference MOT Test Reference
1 Brake pipe slightly corroded (3.6.b.2c) Brake pipe slightly corroded (3.6.b.2c) 12 January 2006 [16:07] 12/01/2006 631922216019 631922216019

ALL XGJ 779W Failure Faults [3]

ALL Failure faults, ORDERED by OCCURRENCE DURING XGJ 779W's MOT HISTORY
ALL XGJ 779W Failure Faults [3]
ALL Failure faults, ORDERED by OCCURRENCE DURING XGJ 779W's MOT HISTORY
Fail Faults | source www.vehiclestats.co.uk
Fault Fault Test Date Test Date/Time Reference MOT Test Reference
1 Nearside front upper suspension arm has excessive play in a ball joint (2.4.g.2) Nearside front upper suspension arm has excessive play in a ball joint (2.4.g.2) 12 January 2006 [16:07] 12/01/2006 631922216019 631922216019
1 Offside front lower suspension arm worn and seriously weakened (2.4.g.1) Offside front lower suspension arm worn and seriously weakened (2.4.g.1) 12 January 2006 [16:07] 12/01/2006 631922216019 631922216019
1 Offside rear shock absorber has a serious fluid leak (2.7.3) Offside rear shock absorber has a serious fluid leak (2.7.3) 12 January 2006 [16:07] 12/01/2006 631922216019 631922216019

ALL XGJ 779W User Entered Faults [2]

ALL User Entered faults, ORDERED by OCCURRENCE DURING XGJ 779W's MOT HISTORY
ALL XGJ 779W User Entered Faults [2]
ALL User Entered faults, ORDERED by OCCURRENCE DURING XGJ 779W's MOT HISTORY
Fail Faults | source www.vehiclestats.co.uk
Fault Fault Test Date Test Date/Time Reference MOT Test Reference
1 O/s & n/s front chassis starting to corroad O/s & n/s front chassis starting to corroad 12 January 2006 [16:07] 12/01/2006 631922216019 631922216019
1 O/s & n/s sill starting to corroad O/s & n/s sill starting to corroad 12 January 2006 [16:07] 12/01/2006 631922216019 631922216019

MOT TEST: 07 June 2007 11:37:36 PASSED
MOT TEST: 07 June 2007 11:37:36 PASSED

This test (612458157191) was completed on the 07 June 2007 11:37:36 and PASSED the requirements for a valid MOT with 0 comments.

This test (612458157191) was completed on the 07 June 2007 11:37:36 and PASSED the requirements for a valid MOT with 0 comments.

Recorded mileage: 70,369

Recorded mileage: 70,369


MOT TEST: 25 January 2006 17:04:28 PASSED
MOT TEST: 25 January 2006 17:04:28 PASSED

This test (664415826011) was completed on the 25 January 2006 17:04:28 and PASSED the requirements for a valid MOT with 0 comments.

This test (664415826011) was completed on the 25 January 2006 17:04:28 and PASSED the requirements for a valid MOT with 0 comments.

Recorded mileage: 69,612

Recorded mileage: 69,612


MOT TEST: 12 January 2006 16:07:04 FAILED
MOT TEST: 12 January 2006 16:07:04 FAILED

This test (631922216019) was completed on the 12 January 2006 16:07:04 and FAILED the requirements for a valid MOT with 6 comments.

This test (631922216019) was completed on the 12 January 2006 16:07:04 and FAILED the requirements for a valid MOT with 6 comments.

Recorded mileage: 69,582

Recorded mileage: 69,582


ADVISORY

FAIL

USER ENTERED