XOE 670


XOE670 is registered to a Green 1958, Morris Oxford with a Petrol engine. It Failed its most recent MOT Test on the 01 May 2012

9 unique faults (10 Total) reported in its MOT History (4 Tests).

1 common/recurring faults.

75% (3) MOT Pass Rate and a 25% (1) MOT Failure Rate.

38,118 recorded miles.

XOE 670


XOE670 is registered to a Green 1958, Morris Oxford with a Petrol engine. It Failed its most recent MOT Test on the 01 May 2012

9 unique faults (10 Total) reported in its MOT History (4 Tests).

1 common/recurring faults.

75% (3) MOT Pass Rate and a 25% (1) MOT Failure Rate.

38,118 recorded miles.

MOT PASS/Failure rate for XOE 670

all MOT test results for XOE 670 represented as a percentage
MOT PASS/Failure rate for XOE 670
all MOT test results for XOE 670 represented as a percentage

PERCENTAGE OF VEHICLE FAULTS WITH XOE 670

ALL REPORTED FAULTS, DISPLAYED BY PERCENTAGE OF OCCURRENCE DURING ALL MOT TESTS
PERCENTAGE OF VEHICLE FAULTS WITH XOE 670
ALL REPORTED FAULTS, DISPLAYED BY PERCENTAGE OF OCCURRENCE DURING ALL MOT TESTS
ADVISORY

FAIL

USER ENTERED

XOE 670 annual Faults by type

ALL REPORTED FAULTS, DISPLAYED over time and categorised by type
XOE 670 annual Faults by type
ALL REPORTED FAULTS, DISPLAYED over time and categorised by type

ALL XOE 670 ADVISORIES [2]

ALL ADVISORIES, ORDERED by OCCURRENCE DURING XOE 670's MOT HISTORY
ALL XOE 670 ADVISORIES [2]
ALL ADVISORIES, ORDERED by OCCURRENCE DURING XOE 670's MOT HISTORY
Advisory Faults | source www.vehiclestats.co.uk
Fault Fault Test Date Test Date/Time Reference MOT Test Reference
2 Exhaust has part of the system slightly deteriorated (7.1.1a) Exhaust has part of the system slightly deteriorated (7.1.1a) 31 January 2011 [11:49] 31/01/2011 27 January 2011 [11:25] 27/01/2011 797821231000 797821231000 578367921084 578367921084

ALL XOE 670 Failure Faults [3]

ALL Failure faults, ORDERED by OCCURRENCE DURING XOE 670's MOT HISTORY
ALL XOE 670 Failure Faults [3]
ALL Failure faults, ORDERED by OCCURRENCE DURING XOE 670's MOT HISTORY
Fail Faults | source www.vehiclestats.co.uk
Fault Fault Test Date Test Date/Time Reference MOT Test Reference
1 Offside front position lamp(s) not working (1.1.a.3b) Offside front position lamp(s) not working (1.1.a.3b) 27 January 2011 [11:25] 27/01/2011 578367921084 578367921084
1 Nearside headlamp not working on dipped beam (1.7.5a) Nearside headlamp not working on dipped beam (1.7.5a) 27 January 2011 [11:25] 27/01/2011 578367921084 578367921084
1 Nearside stop lamp emits other than a steady red light (1.2.1e) Nearside stop lamp emits other than a steady red light (1.2.1e) 27 January 2011 [11:25] 27/01/2011 578367921084 578367921084

ALL XOE 670 User Entered Faults [5]

ALL User Entered faults, ORDERED by OCCURRENCE DURING XOE 670's MOT HISTORY
ALL XOE 670 User Entered Faults [5]
ALL User Entered faults, ORDERED by OCCURRENCE DURING XOE 670's MOT HISTORY
User Entered Faults | source www.vehiclestats.co.uk
Fault Fault Test Date Test Date/Time Reference MOT Test Reference
1 Wet test Wet test 01 May 2012 [12:03] 01/05/2012 816382522115 816382522115
1 Oil leak Oil leak 01 May 2012 [12:03] 01/05/2012 816382522115 816382522115
1 Under body repaires Under body repaires 01 May 2012 [12:03] 01/05/2012 816382522115 816382522115
1 Body has slight corrosion in areas Body has slight corrosion in areas 23 September 2009 [12:23] 23/09/2009 851706169218 851706169218
1 O/s front floor slightly corroded O/s front floor slightly corroded 23 September 2009 [12:23] 23/09/2009 851706169218 851706169218

MOT TEST: 01 May 2012 12:03:33 PASSED
MOT TEST: 01 May 2012 12:03:33 PASSED

This test (816382522115) was completed on the 01 May 2012 12:03:33 and PASSED the requirements for a valid MOT with 3 comments.

This test (816382522115) was completed on the 01 May 2012 12:03:33 and PASSED the requirements for a valid MOT with 3 comments.

Recorded mileage: 38,118

Recorded mileage: 38,118


USER ENTERED


MOT TEST: 31 January 2011 11:49:15 PASSED
MOT TEST: 31 January 2011 11:49:15 PASSED

This test (797821231000) was completed on the 31 January 2011 11:49:15 and PASSED the requirements for a valid MOT with 1 comments.

This test (797821231000) was completed on the 31 January 2011 11:49:15 and PASSED the requirements for a valid MOT with 1 comments.

Recorded mileage: 37,289

Recorded mileage: 37,289


ADVISORY


MOT TEST: 27 January 2011 11:25:34 FAILED
MOT TEST: 27 January 2011 11:25:34 FAILED

This test (578367921084) was completed on the 27 January 2011 11:25:34 and FAILED the requirements for a valid MOT with 4 comments.

This test (578367921084) was completed on the 27 January 2011 11:25:34 and FAILED the requirements for a valid MOT with 4 comments.

Recorded mileage: 37,289

Recorded mileage: 37,289


ADVISORY

FAIL


MOT TEST: 23 September 2009 12:23:03 PASSED
MOT TEST: 23 September 2009 12:23:03 PASSED

This test (851706169218) was completed on the 23 September 2009 12:23:03 and PASSED the requirements for a valid MOT with 2 comments.

This test (851706169218) was completed on the 23 September 2009 12:23:03 and PASSED the requirements for a valid MOT with 2 comments.

Recorded mileage: 36,646

Recorded mileage: 36,646


USER ENTERED