XOG 282J


XOG282J is registered to a Blue 1970, Morris Minor 1000 with a Petrol engine. It Failed its most recent MOT Test on the 30 October 2017

10 unique faults (16 Total) reported in its MOT History (17 Tests).

2 common/recurring faults, the most frequent (6 times) is: Oil leak.

71% (12) MOT Pass Rate and a 29% (5) MOT Failure Rate.

13,549 recorded miles.

XOG 282J


XOG282J is registered to a Blue 1970, Morris Minor 1000 with a Petrol engine. It Failed its most recent MOT Test on the 30 October 2017

10 unique faults (16 Total) reported in its MOT History (17 Tests).

2 common/recurring faults, the most frequent (6 times) is: Oil leak.

71% (12) MOT Pass Rate and a 29% (5) MOT Failure Rate.

13,549 recorded miles.

MOT PASS/Failure rate for XOG 282J

all MOT test results for XOG 282J represented as a percentage
MOT PASS/Failure rate for XOG 282J
all MOT test results for XOG 282J represented as a percentage

PERCENTAGE OF VEHICLE FAULTS WITH XOG 282J

ALL REPORTED FAULTS, DISPLAYED BY PERCENTAGE OF OCCURRENCE DURING ALL MOT TESTS
PERCENTAGE OF VEHICLE FAULTS WITH XOG 282J
ALL REPORTED FAULTS, DISPLAYED BY PERCENTAGE OF OCCURRENCE DURING ALL MOT TESTS
ADVISORY

FAIL

USER ENTERED

PASS WITH RECTIFICATION

XOG 282J annual Faults by type

ALL REPORTED FAULTS, DISPLAYED over time and categorised by type
XOG 282J annual Faults by type
ALL REPORTED FAULTS, DISPLAYED over time and categorised by type

RECURRING FAULTS WITH XOG 282J

FAULTS THAT HAVE OCCURED MORE THAN ONCE DURING XOG 282J's MOT HISTORY
RECURRING FAULTS WITH XOG 282J
FAULTS THAT HAVE OCCURED MORE THAN ONCE DURING XOG 282J's MOT HISTORY
Fault Fault Test Date Test Date/Time Reference MOT Test Reference
6 Oil leak Oil leak 28 June 2013 [10:07] 28/06/2013 22 June 2012 [11:48] 22/06/2012 22 June 2012 [11:48] 22/06/2012 15 July 2011 [10:07] 15/07/2011 18 June 2010 [10:57] 18/06/2010 18 June 2010 [10:57] 18/06/2010 936589573128 936589573128 315814672188 315814672188 276604072466 276604072466 116476091177 116476091177 501339360114 501339360114 640549160173 640549160173
2 Offside rear suspension spring mounting prescribed area is corroded but not considered excessive (2.4.a.3) Offside rear suspension spring mounting prescribed area is corroded but not considered excessive (2.4.a.3) 18 June 2010 [10:57] 18/06/2010 18 June 2010 [10:57] 18/06/2010 501339360114 501339360114 640549160173 640549160173

ALL XOG 282J ADVISORIES [3]

ALL ADVISORIES, ORDERED by OCCURRENCE DURING XOG 282J's MOT HISTORY
ALL XOG 282J ADVISORIES [3]
ALL ADVISORIES, ORDERED by OCCURRENCE DURING XOG 282J's MOT HISTORY
Advisory Faults | source www.vehiclestats.co.uk
Fault Fault Test Date Test Date/Time Reference MOT Test Reference
2 Offside rear suspension spring mounting prescribed area is corroded but not considered excessive (2.4.a.3) Offside rear suspension spring mounting prescribed area is corroded but not considered excessive (2.4.a.3) 18 June 2010 [10:57] 18/06/2010 18 June 2010 [10:57] 18/06/2010 501339360114 501339360114 640549160173 640549160173
1 Offside front seat belt damaged but not affecting the operation of the belt (5.2.2a) Offside front seat belt damaged but not affecting the operation of the belt (5.2.2a) 14 June 2007 [12:19] 14/06/2007 590685067163 590685067163

ALL XOG 282J Failure Faults [3]

ALL Failure faults, ORDERED by OCCURRENCE DURING XOG 282J's MOT HISTORY
ALL XOG 282J Failure Faults [3]
ALL Failure faults, ORDERED by OCCURRENCE DURING XOG 282J's MOT HISTORY
Fail Faults | source www.vehiclestats.co.uk
Fault Fault Test Date Test Date/Time Reference MOT Test Reference
1 Nearside front suspension component mounting prescribed area is excessively corroded chassis (2.4.a.3) Nearside front suspension component mounting prescribed area is excessively corroded chassis (2.4.a.3) 24 June 2016 [10:16] 24/06/2016 525153152012 525153152012
1 Offside rear suspension component mounting prescribed area is excessively corroded valence (2.4.a.3) Offside rear suspension component mounting prescribed area is excessively corroded valence (2.4.a.3) 24 June 2016 [10:16] 24/06/2016 525153152012 525153152012
1 Parking brake: efficiency below requirements (3.7.b.7) Parking brake: efficiency below requirements (3.7.b.7) 13 June 2006 [14:40] 13/06/2006 483894066174 483894066174

ALL XOG 282J User Entered Faults [6]

ALL User Entered faults, ORDERED by OCCURRENCE DURING XOG 282J's MOT HISTORY
ALL XOG 282J User Entered Faults [6]
ALL User Entered faults, ORDERED by OCCURRENCE DURING XOG 282J's MOT HISTORY
User Entered Faults | source www.vehiclestats.co.uk
Fault Fault Test Date Test Date/Time Reference MOT Test Reference
6 Oil leak Oil leak 28 June 2013 [10:07] 28/06/2013 22 June 2012 [11:48] 22/06/2012 22 June 2012 [11:48] 22/06/2012 15 July 2011 [10:07] 15/07/2011 18 June 2010 [10:57] 18/06/2010 18 June 2010 [10:57] 18/06/2010 936589573128 936589573128 315814672188 315814672188 276604072466 276604072466 116476091177 116476091177 501339360114 501339360114 640549160173 640549160173

ALL XOG 282J Pass With Rectification Faults [4]

ALL Pass With Rectification faults, ORDERED by OCCURRENCE DURING XOG 282J's MOT HISTORY
ALL XOG 282J Pass With Rectification Faults [4]
ALL Pass With Rectification faults, ORDERED by OCCURRENCE DURING XOG 282J's MOT HISTORY
Pass With Rectification Faults | source www.vehiclestats.co.uk
Fault Fault Test Date Test Date/Time Reference MOT Test Reference
1 Nearside stop lamp not working (1.2.1b) Nearside stop lamp not working (1.2.1b) 22 June 2012 [11:48] 22/06/2012 276604072466 276604072466
1 Offside stop lamp not working (1.2.1b) Offside stop lamp not working (1.2.1b) 22 June 2012 [11:48] 22/06/2012 276604072466 276604072466
1 Offside registration plate lamp not working (1.1.c.1d) Offside registration plate lamp not working (1.1.c.1d) 18 June 2010 [10:57] 18/06/2010 640549160173 640549160173
1 Offside rear tyre tread depth below requirements of 1.6mm (4.1.e.1) Offside rear tyre tread depth below requirements of 1.6mm (4.1.e.1) 24 June 2008 [12:32] 24/06/2008 693956878111 693956878111

MOT TEST: 30 October 2017 13:22:51 PASSED
MOT TEST: 30 October 2017 13:22:51 PASSED

This test (534648182104) was completed on the 30 October 2017 13:22:51 and PASSED the requirements for a valid MOT with 0 comments.

This test (534648182104) was completed on the 30 October 2017 13:22:51 and PASSED the requirements for a valid MOT with 0 comments.

Recorded mileage: 13,549

Recorded mileage: 13,549


MOT TEST: 06 July 2016 10:10:13 PASSED
MOT TEST: 06 July 2016 10:10:13 PASSED

This test (353543462920) was completed on the 06 July 2016 10:10:13 and PASSED the requirements for a valid MOT with 0 comments.

This test (353543462920) was completed on the 06 July 2016 10:10:13 and PASSED the requirements for a valid MOT with 0 comments.

Recorded mileage: 13,270

Recorded mileage: 13,270


MOT TEST: 24 June 2016 10:16:19 FAILED
MOT TEST: 24 June 2016 10:16:19 FAILED

This test (525153152012) was completed on the 24 June 2016 10:16:19 and FAILED the requirements for a valid MOT with 2 comments.

This test (525153152012) was completed on the 24 June 2016 10:16:19 and FAILED the requirements for a valid MOT with 2 comments.

Recorded mileage: 13,260

Recorded mileage: 13,260


FAIL


MOT TEST: 26 June 2015 13:40:26 PASSED
MOT TEST: 26 June 2015 13:40:26 PASSED

This test (809147275195) was completed on the 26 June 2015 13:40:26 and PASSED the requirements for a valid MOT with 0 comments.

This test (809147275195) was completed on the 26 June 2015 13:40:26 and PASSED the requirements for a valid MOT with 0 comments.

Recorded mileage: 12,734

Recorded mileage: 12,734


MOT TEST: 27 June 2014 13:13:15 PASSED
MOT TEST: 27 June 2014 13:13:15 PASSED

This test (677018774144) was completed on the 27 June 2014 13:13:15 and PASSED the requirements for a valid MOT with 0 comments.

This test (677018774144) was completed on the 27 June 2014 13:13:15 and PASSED the requirements for a valid MOT with 0 comments.

Recorded mileage: 12,560

Recorded mileage: 12,560


MOT TEST: 28 June 2013 10:07:05 PASSED
MOT TEST: 28 June 2013 10:07:05 PASSED

This test (936589573128) was completed on the 28 June 2013 10:07:05 and PASSED the requirements for a valid MOT with 1 comments.

This test (936589573128) was completed on the 28 June 2013 10:07:05 and PASSED the requirements for a valid MOT with 1 comments.

Recorded mileage: 12,218

Recorded mileage: 12,218


USER ENTERED


MOT TEST: 22 June 2012 11:48:42 PASSED
MOT TEST: 22 June 2012 11:48:42 PASSED

This test (315814672188) was completed on the 22 June 2012 11:48:42 and PASSED the requirements for a valid MOT with 1 comments.

This test (315814672188) was completed on the 22 June 2012 11:48:42 and PASSED the requirements for a valid MOT with 1 comments.

Recorded mileage: 11,595

Recorded mileage: 11,595


USER ENTERED


MOT TEST: 22 June 2012 11:48:42 FAILED
MOT TEST: 22 June 2012 11:48:42 FAILED

This test (276604072466) was completed on the 22 June 2012 11:48:42 and FAILED the requirements for a valid MOT with 3 comments.

This test (276604072466) was completed on the 22 June 2012 11:48:42 and FAILED the requirements for a valid MOT with 3 comments.

Recorded mileage: 11,595

Recorded mileage: 11,595


USER ENTERED

PASS WITH RECTIFICATION


MOT TEST: 15 July 2011 10:07:28 PASSED
MOT TEST: 15 July 2011 10:07:28 PASSED

This test (116476091177) was completed on the 15 July 2011 10:07:28 and PASSED the requirements for a valid MOT with 1 comments.

This test (116476091177) was completed on the 15 July 2011 10:07:28 and PASSED the requirements for a valid MOT with 1 comments.

Recorded mileage: 11,279

Recorded mileage: 11,279


USER ENTERED


MOT TEST: 18 June 2010 10:57:51 PASSED
MOT TEST: 18 June 2010 10:57:51 PASSED

This test (501339360114) was completed on the 18 June 2010 10:57:51 and PASSED the requirements for a valid MOT with 2 comments.

This test (501339360114) was completed on the 18 June 2010 10:57:51 and PASSED the requirements for a valid MOT with 2 comments.

Recorded mileage: 11,029

Recorded mileage: 11,029


ADVISORY

USER ENTERED


MOT TEST: 18 June 2010 10:57:51 FAILED
MOT TEST: 18 June 2010 10:57:51 FAILED

This test (640549160173) was completed on the 18 June 2010 10:57:51 and FAILED the requirements for a valid MOT with 3 comments.

This test (640549160173) was completed on the 18 June 2010 10:57:51 and FAILED the requirements for a valid MOT with 3 comments.

Recorded mileage: 11,029

Recorded mileage: 11,029


ADVISORY

USER ENTERED

PASS WITH RECTIFICATION


MOT TEST: 12 June 2009 15:59:20 PASSED
MOT TEST: 12 June 2009 15:59:20 PASSED

This test (181843069152) was completed on the 12 June 2009 15:59:20 and PASSED the requirements for a valid MOT with 0 comments.

This test (181843069152) was completed on the 12 June 2009 15:59:20 and PASSED the requirements for a valid MOT with 0 comments.

Recorded mileage: 9,745

Recorded mileage: 9,745


MOT TEST: 24 June 2008 12:32:26 PASSED
MOT TEST: 24 June 2008 12:32:26 PASSED

This test (842996278177) was completed on the 24 June 2008 12:32:26 and PASSED the requirements for a valid MOT with 0 comments.

This test (842996278177) was completed on the 24 June 2008 12:32:26 and PASSED the requirements for a valid MOT with 0 comments.

Recorded mileage: 9,023

Recorded mileage: 9,023


MOT TEST: 24 June 2008 12:32:26 FAILED
MOT TEST: 24 June 2008 12:32:26 FAILED

This test (693956878111) was completed on the 24 June 2008 12:32:26 and FAILED the requirements for a valid MOT with 1 comments.

This test (693956878111) was completed on the 24 June 2008 12:32:26 and FAILED the requirements for a valid MOT with 1 comments.

Recorded mileage: 9,023

Recorded mileage: 9,023


PASS WITH RECTIFICATION


MOT TEST: 14 June 2007 12:19:14 PASSED
MOT TEST: 14 June 2007 12:19:14 PASSED

This test (590685067163) was completed on the 14 June 2007 12:19:14 and PASSED the requirements for a valid MOT with 1 comments.

This test (590685067163) was completed on the 14 June 2007 12:19:14 and PASSED the requirements for a valid MOT with 1 comments.

Recorded mileage: 7,681

Recorded mileage: 7,681


ADVISORY


MOT TEST: 14 June 2006 13:54:40 PASSED
MOT TEST: 14 June 2006 13:54:40 PASSED

This test (651475066187) was completed on the 14 June 2006 13:54:40 and PASSED the requirements for a valid MOT with 0 comments.

This test (651475066187) was completed on the 14 June 2006 13:54:40 and PASSED the requirements for a valid MOT with 0 comments.

Recorded mileage: 6,383

Recorded mileage: 6,383


MOT TEST: 13 June 2006 14:40:05 FAILED
MOT TEST: 13 June 2006 14:40:05 FAILED

This test (483894066174) was completed on the 13 June 2006 14:40:05 and FAILED the requirements for a valid MOT with 1 comments.

This test (483894066174) was completed on the 13 June 2006 14:40:05 and FAILED the requirements for a valid MOT with 1 comments.

Recorded mileage: 6,372

Recorded mileage: 6,372


FAIL