XOG 809J


XOG809J is registered to a Blue 1971, Morris Minor 1000 with a Petrol engine. It Failed its most recent MOT Test on the 30 April 2018

18 unique faults (18 Total) reported in its MOT History (14 Tests).

0 common/recurring faults.

71% (10) MOT Pass Rate and a 29% (4) MOT Failure Rate.

76,007 recorded miles.

XOG 809J


XOG809J is registered to a Blue 1971, Morris Minor 1000 with a Petrol engine. It Failed its most recent MOT Test on the 30 April 2018

18 unique faults (18 Total) reported in its MOT History (14 Tests).

0 common/recurring faults.

71% (10) MOT Pass Rate and a 29% (4) MOT Failure Rate.

76,007 recorded miles.

MOT PASS/Failure rate for XOG 809J

all MOT test results for XOG 809J represented as a percentage
MOT PASS/Failure rate for XOG 809J
all MOT test results for XOG 809J represented as a percentage

PERCENTAGE OF VEHICLE FAULTS WITH XOG 809J

ALL REPORTED FAULTS, DISPLAYED BY PERCENTAGE OF OCCURRENCE DURING ALL MOT TESTS
PERCENTAGE OF VEHICLE FAULTS WITH XOG 809J
ALL REPORTED FAULTS, DISPLAYED BY PERCENTAGE OF OCCURRENCE DURING ALL MOT TESTS
ADVISORY

FAIL

USER ENTERED

XOG 809J annual Faults by type

ALL REPORTED FAULTS, DISPLAYED over time and categorised by type
XOG 809J annual Faults by type
ALL REPORTED FAULTS, DISPLAYED over time and categorised by type

ALL XOG 809J ADVISORIES [3]

ALL ADVISORIES, ORDERED by OCCURRENCE DURING XOG 809J's MOT HISTORY
ALL XOG 809J ADVISORIES [3]
ALL ADVISORIES, ORDERED by OCCURRENCE DURING XOG 809J's MOT HISTORY
Advisory Faults | source www.vehiclestats.co.uk
Fault Fault Test Date Test Date/Time Reference MOT Test Reference
1 Nearside front upper steering pivot point has slight play (2.2.b.1g) Nearside front upper steering pivot point has slight play (2.2.b.1g) 12 June 2014 [11:58] 12/06/2014 948553464187 948553464187
1 Offside front upper steering pivot point has slight play (2.2.b.1g) Offside front upper steering pivot point has slight play (2.2.b.1g) 12 June 2014 [11:58] 12/06/2014 948553464187 948553464187
1 Brakes imbalanced requirements only just met. It would appear that the braking system requires adjustment or repair. (3.7.b.5b) Brakes imbalanced requirements only just met. It would appear that the braking system requires adjustment or repair. (3.7.b.5b) 13 March 2007 [11:13] 13/03/2007 502802277078 502802277078

ALL XOG 809J Failure Faults [9]

ALL Failure faults, ORDERED by OCCURRENCE DURING XOG 809J's MOT HISTORY
ALL XOG 809J Failure Faults [9]
ALL Failure faults, ORDERED by OCCURRENCE DURING XOG 809J's MOT HISTORY
Fail Faults | source www.vehiclestats.co.uk
Fault Fault Test Date Test Date/Time Reference MOT Test Reference
1 Nearside rear suspension spring mounting prescribed area is excessively corroded (2.4.a.3) Nearside rear suspension spring mounting prescribed area is excessively corroded (2.4.a.3) 27 February 2012 [15:57] 27/02/2012 185088552026 185088552026
1 Offside inner rear suspension spring mounting prescribed area is excessively corroded (2.4.a.3) Offside inner rear suspension spring mounting prescribed area is excessively corroded (2.4.a.3) 27 February 2012 [15:57] 27/02/2012 185088552026 185088552026
1 Nearside inner rear suspension spring mounting prescribed area is excessively corroded (2.4.a.3) Nearside inner rear suspension spring mounting prescribed area is excessively corroded (2.4.a.3) 27 February 2012 [15:57] 27/02/2012 185088552026 185088552026
1 Offside front lower steering pivot point has excessive play (2.2.b.1g) Offside front lower steering pivot point has excessive play (2.2.b.1g) 27 February 2012 [15:57] 27/02/2012 185088552026 185088552026
1 Offside steering rack gaiter split (2.2.d.2d) Offside steering rack gaiter split (2.2.d.2d) 01 March 2011 [15:10] 01/03/2011 306780861018 306780861018
1 Front brake application uneven (3.7.b.2) Front brake application uneven (3.7.b.2) 15 February 2008 [11:12] 15/02/2008 341316748029 341316748029
1 Offside vehicle structure has excessive corrosion which adversely affects braking or steering (6.1.a.1) Offside vehicle structure has excessive corrosion which adversely affects braking or steering (6.1.a.1) 15 February 2008 [11:12] 15/02/2008 341316748029 341316748029
1 Nearside front suspension component mounting prescribed area is excessively corroded (2.4.a.3) Nearside front suspension component mounting prescribed area is excessively corroded (2.4.a.3) 06 March 2006 [11:24] 06/03/2006 644435966078 644435966078
1 Offside rear mechanical brake component has restricted free movement (3.5.1k) Offside rear mechanical brake component has restricted free movement (3.5.1k) 06 March 2006 [11:24] 06/03/2006 644435966078 644435966078

ALL XOG 809J User Entered Faults [6]

ALL User Entered faults, ORDERED by OCCURRENCE DURING XOG 809J's MOT HISTORY
ALL XOG 809J User Entered Faults [6]
ALL User Entered faults, ORDERED by OCCURRENCE DURING XOG 809J's MOT HISTORY
Fail Faults | source www.vehiclestats.co.uk
Fault Fault Test Date Test Date/Time Reference MOT Test Reference
1 All underside of car rusted and heavily under sealed in places All underside of car rusted and heavily under sealed in places 27 February 2012 [15:57] 27/02/2012 185088552026 185088552026
1 All metal brake pipes starting to rust All metal brake pipes starting to rust 27 February 2012 [15:57] 27/02/2012 185088552026 185088552026
1 All rear spring bushes cracked/split but have no play in All rear spring bushes cracked/split but have no play in 27 February 2012 [15:57] 27/02/2012 185088552026 185088552026
1 Brake declorometer test carried out on the road and on the way back to workshop rear wheels locked and prop u/j broke Brake declorometer test carried out on the road and on the way back to workshop rear wheels locked and prop u/j broke 27 February 2012 [15:57] 27/02/2012 185088552026 185088552026
1 As per test no 644435966078 As per test no 644435966078 07 March 2006 [15:52] 07/03/2006 601866966071 601866966071
1 O/s/f inner sill rusted close to seat mountings O/s/f inner sill rusted close to seat mountings 06 March 2006 [11:24] 06/03/2006 644435966078 644435966078

MOT TEST: 30 April 2018 14:07:40 PASSED
MOT TEST: 30 April 2018 14:07:40 PASSED

This test (967294551480) was completed on the 30 April 2018 14:07:40 and PASSED the requirements for a valid MOT with 0 comments.

This test (967294551480) was completed on the 30 April 2018 14:07:40 and PASSED the requirements for a valid MOT with 0 comments.

Recorded mileage: 76,007

Recorded mileage: 76,007


MOT TEST: 12 June 2014 11:58:32 PASSED
MOT TEST: 12 June 2014 11:58:32 PASSED

This test (948553464187) was completed on the 12 June 2014 11:58:32 and PASSED the requirements for a valid MOT with 2 comments.

This test (948553464187) was completed on the 12 June 2014 11:58:32 and PASSED the requirements for a valid MOT with 2 comments.

Recorded mileage: 75,874

Recorded mileage: 75,874


ADVISORY


MOT TEST: 29 April 2013 15:25:58 PASSED
MOT TEST: 29 April 2013 15:25:58 PASSED

This test (418229213118) was completed on the 29 April 2013 15:25:58 and PASSED the requirements for a valid MOT with 0 comments.

This test (418229213118) was completed on the 29 April 2013 15:25:58 and PASSED the requirements for a valid MOT with 0 comments.

Recorded mileage: 74,449

Recorded mileage: 74,449


MOT TEST: 10 April 2012 13:02:16 PASSED
MOT TEST: 10 April 2012 13:02:16 PASSED

This test (867861302164) was completed on the 10 April 2012 13:02:16 and PASSED the requirements for a valid MOT with 0 comments.

This test (867861302164) was completed on the 10 April 2012 13:02:16 and PASSED the requirements for a valid MOT with 0 comments.

Recorded mileage: 72,851

Recorded mileage: 72,851


MOT TEST: 27 February 2012 15:57:25 FAILED
MOT TEST: 27 February 2012 15:57:25 FAILED

This test (185088552026) was completed on the 27 February 2012 15:57:25 and FAILED the requirements for a valid MOT with 8 comments.

This test (185088552026) was completed on the 27 February 2012 15:57:25 and FAILED the requirements for a valid MOT with 8 comments.

Recorded mileage: 72,827

Recorded mileage: 72,827


FAIL

USER ENTERED


MOT TEST: 05 March 2011 08:26:22 PASSED
MOT TEST: 05 March 2011 08:26:22 PASSED

This test (296714561036) was completed on the 05 March 2011 08:26:22 and PASSED the requirements for a valid MOT with 0 comments.

This test (296714561036) was completed on the 05 March 2011 08:26:22 and PASSED the requirements for a valid MOT with 0 comments.

Recorded mileage: 72,486

Recorded mileage: 72,486


MOT TEST: 01 March 2011 15:10:16 FAILED
MOT TEST: 01 March 2011 15:10:16 FAILED

This test (306780861018) was completed on the 01 March 2011 15:10:16 and FAILED the requirements for a valid MOT with 1 comments.

This test (306780861018) was completed on the 01 March 2011 15:10:16 and FAILED the requirements for a valid MOT with 1 comments.

Recorded mileage: 72,486

Recorded mileage: 72,486


FAIL


MOT TEST: 09 March 2010 11:17:47 PASSED
MOT TEST: 09 March 2010 11:17:47 PASSED

This test (190358060420) was completed on the 09 March 2010 11:17:47 and PASSED the requirements for a valid MOT with 0 comments.

This test (190358060420) was completed on the 09 March 2010 11:17:47 and PASSED the requirements for a valid MOT with 0 comments.

Recorded mileage: 72,180

Recorded mileage: 72,180


MOT TEST: 05 March 2009 11:39:37 PASSED
MOT TEST: 05 March 2009 11:39:37 PASSED

This test (483514669093) was completed on the 05 March 2009 11:39:37 and PASSED the requirements for a valid MOT with 0 comments.

This test (483514669093) was completed on the 05 March 2009 11:39:37 and PASSED the requirements for a valid MOT with 0 comments.

Recorded mileage: 71,860

Recorded mileage: 71,860


MOT TEST: 26 February 2008 10:36:42 PASSED
MOT TEST: 26 February 2008 10:36:42 PASSED

This test (271877258010) was completed on the 26 February 2008 10:36:42 and PASSED the requirements for a valid MOT with 0 comments.

This test (271877258010) was completed on the 26 February 2008 10:36:42 and PASSED the requirements for a valid MOT with 0 comments.

Recorded mileage: 71,711

Recorded mileage: 71,711


MOT TEST: 15 February 2008 11:12:32 FAILED
MOT TEST: 15 February 2008 11:12:32 FAILED

This test (341316748029) was completed on the 15 February 2008 11:12:32 and FAILED the requirements for a valid MOT with 2 comments.

This test (341316748029) was completed on the 15 February 2008 11:12:32 and FAILED the requirements for a valid MOT with 2 comments.

Recorded mileage: 71,711

Recorded mileage: 71,711


FAIL


MOT TEST: 13 March 2007 11:13:52 PASSED
MOT TEST: 13 March 2007 11:13:52 PASSED

This test (502802277078) was completed on the 13 March 2007 11:13:52 and PASSED the requirements for a valid MOT with 1 comments.

This test (502802277078) was completed on the 13 March 2007 11:13:52 and PASSED the requirements for a valid MOT with 1 comments.

Recorded mileage: 71,297

Recorded mileage: 71,297


ADVISORY


MOT TEST: 07 March 2006 15:52:17 PASSED
MOT TEST: 07 March 2006 15:52:17 PASSED

This test (601866966071) was completed on the 07 March 2006 15:52:17 and PASSED the requirements for a valid MOT with 1 comments.

This test (601866966071) was completed on the 07 March 2006 15:52:17 and PASSED the requirements for a valid MOT with 1 comments.

Recorded mileage: 70,735

Recorded mileage: 70,735


USER ENTERED


MOT TEST: 06 March 2006 11:24:28 FAILED
MOT TEST: 06 March 2006 11:24:28 FAILED

This test (644435966078) was completed on the 06 March 2006 11:24:28 and FAILED the requirements for a valid MOT with 3 comments.

This test (644435966078) was completed on the 06 March 2006 11:24:28 and FAILED the requirements for a valid MOT with 3 comments.

Recorded mileage: 70,733

Recorded mileage: 70,733


FAIL

USER ENTERED