XOT 468J


XOT468J is registered to a White 1970, Morris Minor 1000 with a Petrol engine. It Failed its most recent MOT Test on the 23 February 2017

18 unique faults (22 Total) reported in its MOT History (10 Tests).

1 common/recurring faults.

60% (6) MOT Pass Rate and a 40% (4) MOT Failure Rate.

10,540 recorded miles.

XOT 468J


XOT468J is registered to a White 1970, Morris Minor 1000 with a Petrol engine. It Failed its most recent MOT Test on the 23 February 2017

18 unique faults (22 Total) reported in its MOT History (10 Tests).

1 common/recurring faults.

60% (6) MOT Pass Rate and a 40% (4) MOT Failure Rate.

10,540 recorded miles.

MOT PASS/Failure rate for XOT 468J

all MOT test results for XOT 468J represented as a percentage
MOT PASS/Failure rate for XOT 468J
all MOT test results for XOT 468J represented as a percentage

PERCENTAGE OF VEHICLE FAULTS WITH XOT 468J

ALL REPORTED FAULTS, DISPLAYED BY PERCENTAGE OF OCCURRENCE DURING ALL MOT TESTS
PERCENTAGE OF VEHICLE FAULTS WITH XOT 468J
ALL REPORTED FAULTS, DISPLAYED BY PERCENTAGE OF OCCURRENCE DURING ALL MOT TESTS
ADVISORY

FAIL

USER ENTERED

XOT 468J annual Faults by type

ALL REPORTED FAULTS, DISPLAYED over time and categorised by type
XOT 468J annual Faults by type
ALL REPORTED FAULTS, DISPLAYED over time and categorised by type

ALL XOT 468J ADVISORIES [4]

ALL ADVISORIES, ORDERED by OCCURRENCE DURING XOT 468J's MOT HISTORY
ALL XOT 468J ADVISORIES [4]
ALL ADVISORIES, ORDERED by OCCURRENCE DURING XOT 468J's MOT HISTORY
Advisory Faults | source www.vehiclestats.co.uk
Fault Fault Test Date Test Date/Time Reference MOT Test Reference
4 Unable to check wheel bolts,wheel trims fitted Unable to check wheel bolts,wheel trims fitted 23 February 2017 [16:14] 23/02/2017 17 February 2017 [11:21] 17/02/2017 18 February 2016 [16:33] 18/02/2016 16 February 2016 [12:55] 16/02/2016 450942826167 450942826167 914562389854 914562389854 912452533826 912452533826 675925365893 675925365893

ALL XOT 468J Failure Faults [17]

ALL Failure faults, ORDERED by OCCURRENCE DURING XOT 468J's MOT HISTORY
ALL XOT 468J Failure Faults [17]
ALL Failure faults, ORDERED by OCCURRENCE DURING XOT 468J's MOT HISTORY
Advisory Faults | source www.vehiclestats.co.uk
Fault Fault Test Date Test Date/Time Reference MOT Test Reference
1 Offside stop lamp not working (1.2.1b) Offside stop lamp not working (1.2.1b) 17 February 2017 [11:21] 17/02/2017 914562389854 914562389854
1 Offside rear position lamp(s) adversely affected by the operation of another lamp (1.1.a.3f) Offside rear position lamp(s) adversely affected by the operation of another lamp (1.1.a.3f) 17 February 2017 [11:21] 17/02/2017 914562389854 914562389854
1 Nearside front position lamp(s) not working (1.1.a.3b) Nearside front position lamp(s) not working (1.1.a.3b) 17 February 2017 [11:21] 17/02/2017 914562389854 914562389854
1 Nearside front brake binding (3.7.b.1) Nearside front brake binding (3.7.b.1) 16 February 2016 [12:55] 16/02/2016 675925365893 675925365893
1 Nearside rear brake binding (3.7.b.1) Nearside rear brake binding (3.7.b.1) 16 February 2016 [12:55] 16/02/2016 675925365893 675925365893
1 Offside rear parking brake recording little or no effort (3.7.b.6a) Offside rear parking brake recording little or no effort (3.7.b.6a) 16 February 2016 [12:55] 16/02/2016 675925365893 675925365893
1 Nearside windscreen washer provides insufficient washer liquid (8.2.3) Nearside windscreen washer provides insufficient washer liquid (8.2.3) 17 December 2013 [10:39] 17/12/2013 625441253381 625441253381
1 Horn not working (1.6.2a) Horn not working (1.6.2a) 17 December 2013 [10:39] 17/12/2013 625441253381 625441253381
1 Indicator tell tale inoperative (1.4.a.2a) Indicator tell tale inoperative (1.4.a.2a) 17 December 2013 [10:39] 17/12/2013 625441253381 625441253381
1 Front brake application uneven (3.7.b.2) Front brake application uneven (3.7.b.2) 17 December 2013 [10:39] 17/12/2013 625441253381 625441253381
1 Brakes imbalanced across an axle (3.7.b.5b) Brakes imbalanced across an axle (3.7.b.5b) 17 December 2013 [10:39] 17/12/2013 625441253381 625441253381
1 Nearside headlamp not working on dipped beam (1.7.5a) Nearside headlamp not working on dipped beam (1.7.5a) 07 December 2012 [11:57] 07/12/2012 447092442338 447092442338
1 Rear registration plate insecure (6.3.1b) Rear registration plate insecure (6.3.1b) 07 December 2012 [11:57] 07/12/2012 447092442338 447092442338
1 Nearside rear leaf spring has a deteriorated shackle pin rubber bush resulting in excessive movement (2.4.b.2) Nearside rear leaf spring has a deteriorated shackle pin rubber bush resulting in excessive movement (2.4.b.2) 07 December 2012 [11:57] 07/12/2012 447092442338 447092442338
1 Offside rear leaf spring has a deteriorated shackle pin rubber bush resulting in excessive movement (2.4.b.2) Offside rear leaf spring has a deteriorated shackle pin rubber bush resulting in excessive movement (2.4.b.2) 07 December 2012 [11:57] 07/12/2012 447092442338 447092442338
1 Nearside rear suspension spring mounting prescribed area is inadequately repaired (2.4.a.3) Nearside rear suspension spring mounting prescribed area is inadequately repaired (2.4.a.3) 07 December 2012 [11:57] 07/12/2012 447092442338 447092442338
1 Offside rear suspension spring mounting prescribed area is inadequately repaired (2.4.a.3) Offside rear suspension spring mounting prescribed area is inadequately repaired (2.4.a.3) 07 December 2012 [11:57] 07/12/2012 447092442338 447092442338

ALL XOT 468J User Entered Faults [1]

ALL User Entered faults, ORDERED by OCCURRENCE DURING XOT 468J's MOT HISTORY
ALL XOT 468J User Entered Faults [1]
ALL User Entered faults, ORDERED by OCCURRENCE DURING XOT 468J's MOT HISTORY
User Entered Faults | source www.vehiclestats.co.uk
Fault Fault Test Date Test Date/Time Reference MOT Test Reference
1 Unable to check wheel bolts,wheel trims fitted Unable to check wheel bolts,wheel trims fitted 14 January 2015 [09:43] 14/01/2015 479364615069 479364615069

MOT TEST: 23 February 2017 16:14:18 PASSED
MOT TEST: 23 February 2017 16:14:18 PASSED

This test (450942826167) was completed on the 23 February 2017 16:14:18 and PASSED the requirements for a valid MOT with 1 comments.

This test (450942826167) was completed on the 23 February 2017 16:14:18 and PASSED the requirements for a valid MOT with 1 comments.

Recorded mileage: 10,540

Recorded mileage: 10,540


ADVISORY


MOT TEST: 17 February 2017 11:21:17 FAILED
MOT TEST: 17 February 2017 11:21:17 FAILED

This test (914562389854) was completed on the 17 February 2017 11:21:17 and FAILED the requirements for a valid MOT with 4 comments.

This test (914562389854) was completed on the 17 February 2017 11:21:17 and FAILED the requirements for a valid MOT with 4 comments.

Recorded mileage: 10,540

Recorded mileage: 10,540


ADVISORY

FAIL


MOT TEST: 18 February 2016 16:33:27 PASSED
MOT TEST: 18 February 2016 16:33:27 PASSED

This test (912452533826) was completed on the 18 February 2016 16:33:27 and PASSED the requirements for a valid MOT with 1 comments.

This test (912452533826) was completed on the 18 February 2016 16:33:27 and PASSED the requirements for a valid MOT with 1 comments.

Recorded mileage: 10,428

Recorded mileage: 10,428


ADVISORY


MOT TEST: 16 February 2016 12:55:36 FAILED
MOT TEST: 16 February 2016 12:55:36 FAILED

This test (675925365893) was completed on the 16 February 2016 12:55:36 and FAILED the requirements for a valid MOT with 4 comments.

This test (675925365893) was completed on the 16 February 2016 12:55:36 and FAILED the requirements for a valid MOT with 4 comments.

Recorded mileage: 10,428

Recorded mileage: 10,428


ADVISORY

FAIL


MOT TEST: 14 January 2015 09:43:28 PASSED
MOT TEST: 14 January 2015 09:43:28 PASSED

This test (479364615069) was completed on the 14 January 2015 09:43:28 and PASSED the requirements for a valid MOT with 1 comments.

This test (479364615069) was completed on the 14 January 2015 09:43:28 and PASSED the requirements for a valid MOT with 1 comments.

Recorded mileage: 10,402

Recorded mileage: 10,402


USER ENTERED


MOT TEST: 10 January 2014 13:59:34 PASSED
MOT TEST: 10 January 2014 13:59:34 PASSED

This test (196660614067) was completed on the 10 January 2014 13:59:34 and PASSED the requirements for a valid MOT with 0 comments.

This test (196660614067) was completed on the 10 January 2014 13:59:34 and PASSED the requirements for a valid MOT with 0 comments.

Recorded mileage: 10,374

Recorded mileage: 10,374


MOT TEST: 17 December 2013 10:39:44 FAILED
MOT TEST: 17 December 2013 10:39:44 FAILED

This test (625441253381) was completed on the 17 December 2013 10:39:44 and FAILED the requirements for a valid MOT with 5 comments.

This test (625441253381) was completed on the 17 December 2013 10:39:44 and FAILED the requirements for a valid MOT with 5 comments.

Recorded mileage: 10,374

Recorded mileage: 10,374


FAIL


MOT TEST: 18 December 2012 15:05:28 PASSED
MOT TEST: 18 December 2012 15:05:28 PASSED

This test (389963552372) was completed on the 18 December 2012 15:05:28 and PASSED the requirements for a valid MOT with 0 comments.

This test (389963552372) was completed on the 18 December 2012 15:05:28 and PASSED the requirements for a valid MOT with 0 comments.

Recorded mileage: 10,265

Recorded mileage: 10,265


MOT TEST: 07 December 2012 11:57:06 FAILED
MOT TEST: 07 December 2012 11:57:06 FAILED

This test (447092442338) was completed on the 07 December 2012 11:57:06 and FAILED the requirements for a valid MOT with 6 comments.

This test (447092442338) was completed on the 07 December 2012 11:57:06 and FAILED the requirements for a valid MOT with 6 comments.

Recorded mileage: 10,264

Recorded mileage: 10,264


FAIL


MOT TEST: 24 November 2006 14:42:44 PASSED
MOT TEST: 24 November 2006 14:42:44 PASSED

This test (484708126468) was completed on the 24 November 2006 14:42:44 and PASSED the requirements for a valid MOT with 0 comments.

This test (484708126468) was completed on the 24 November 2006 14:42:44 and PASSED the requirements for a valid MOT with 0 comments.

Recorded mileage: 10,240

Recorded mileage: 10,240