XOV 804J


XOV804J is registered to a Black 1971, Morris Mini 1000 with a Petrol engine. It Failed its most recent MOT Test on the 29 August 2017

13 unique faults (16 Total) reported in its MOT History (8 Tests).

3 common/recurring faults, the most frequent (2 times) is: Subframe mounting prescribed area modified, but not inappropriately (2.4.A.3).

62% (5) MOT Pass Rate and a 38% (3) MOT Failure Rate.

54,874 recorded miles.

XOV 804J


XOV804J is registered to a Black 1971, Morris Mini 1000 with a Petrol engine. It Failed its most recent MOT Test on the 29 August 2017

13 unique faults (16 Total) reported in its MOT History (8 Tests).

3 common/recurring faults, the most frequent (2 times) is: Subframe mounting prescribed area modified, but not inappropriately (2.4.A.3).

62% (5) MOT Pass Rate and a 38% (3) MOT Failure Rate.

54,874 recorded miles.

MOT PASS/Failure rate for XOV 804J

all MOT test results for XOV 804J represented as a percentage
MOT PASS/Failure rate for XOV 804J
all MOT test results for XOV 804J represented as a percentage

PERCENTAGE OF VEHICLE FAULTS WITH XOV 804J

ALL REPORTED FAULTS, DISPLAYED BY PERCENTAGE OF OCCURRENCE DURING ALL MOT TESTS
PERCENTAGE OF VEHICLE FAULTS WITH XOV 804J
ALL REPORTED FAULTS, DISPLAYED BY PERCENTAGE OF OCCURRENCE DURING ALL MOT TESTS
ADVISORY

FAIL

XOV 804J annual Faults by type

ALL REPORTED FAULTS, DISPLAYED over time and categorised by type
XOV 804J annual Faults by type
ALL REPORTED FAULTS, DISPLAYED over time and categorised by type

RECURRING FAULTS WITH XOV 804J

FAULTS THAT HAVE OCCURED MORE THAN ONCE DURING XOV 804J's MOT HISTORY
RECURRING FAULTS WITH XOV 804J
FAULTS THAT HAVE OCCURED MORE THAN ONCE DURING XOV 804J's MOT HISTORY
Fault Fault Test Date Test Date/Time Reference MOT Test Reference
2 Subframe mounting prescribed area modified, but not inappropriately (2.4.a.3) Subframe mounting prescribed area modified, but not inappropriately (2.4.a.3) 29 August 2017 [07:13] 29/08/2017 21 August 2017 [10:15] 21/08/2017 824687444337 824687444337 188143206898 188143206898
2 Rear brakes imbalanced across an axle axle 2 (3.7.b.5b) Rear brakes imbalanced across an axle axle 2 (3.7.b.5b) 21 August 2017 [10:15] 21/08/2017 04 August 2016 [09:26] 04/08/2016 188143206898 188143206898 504683270803 504683270803
2 Parking brake: efficiency below requirements (3.7.b.7) Parking brake: efficiency below requirements (3.7.b.7) 04 August 2016 [09:26] 04/08/2016 19 August 2015 [11:19] 19/08/2015 504683270803 504683270803 460527468413 460527468413

ALL XOV 804J ADVISORIES [3]

ALL ADVISORIES, ORDERED by OCCURRENCE DURING XOV 804J's MOT HISTORY
ALL XOV 804J ADVISORIES [3]
ALL ADVISORIES, ORDERED by OCCURRENCE DURING XOV 804J's MOT HISTORY
Advisory Faults | source www.vehiclestats.co.uk
Fault Fault Test Date Test Date/Time Reference MOT Test Reference
2 Subframe mounting prescribed area modified, but not inappropriately (2.4.a.3) Subframe mounting prescribed area modified, but not inappropriately (2.4.a.3) 29 August 2017 [07:13] 29/08/2017 21 August 2017 [10:15] 21/08/2017 824687444337 824687444337 188143206898 188143206898
1 Offside rear rear wheel bearing has slight play (2.6.2) Offside rear rear wheel bearing has slight play (2.6.2) 21 August 2017 [10:15] 21/08/2017 188143206898 188143206898

ALL XOV 804J Failure Faults [13]

ALL Failure faults, ORDERED by OCCURRENCE DURING XOV 804J's MOT HISTORY
ALL XOV 804J Failure Faults [13]
ALL Failure faults, ORDERED by OCCURRENCE DURING XOV 804J's MOT HISTORY
Fail Faults | source www.vehiclestats.co.uk
Fault Fault Test Date Test Date/Time Reference MOT Test Reference
2 Rear brakes imbalanced across an axle axle 2 (3.7.b.5b) Rear brakes imbalanced across an axle axle 2 (3.7.b.5b) 21 August 2017 [10:15] 21/08/2017 04 August 2016 [09:26] 04/08/2016 188143206898 188143206898 504683270803 504683270803
2 Parking brake: efficiency below requirements (3.7.b.7) Parking brake: efficiency below requirements (3.7.b.7) 04 August 2016 [09:26] 04/08/2016 19 August 2015 [11:19] 19/08/2015 504683270803 504683270803 460527468413 460527468413
1 Hazard warning switch faulty (1.4.b.1d) Hazard warning switch faulty (1.4.b.1d) 21 August 2017 [10:15] 21/08/2017 188143206898 188143206898
1 Nearside front track rod end ball joint dust cover excessively deteriorated so that it no longer prevents the ingress of dirt (2.2.c.1c) Nearside front track rod end ball joint dust cover excessively deteriorated so that it no longer prevents the ingress of dirt (2.2.c.1c) 21 August 2017 [10:15] 21/08/2017 188143206898 188143206898
1 Offside front track rod end ball joint dust cover excessively deteriorated so that it no longer prevents the ingress of dirt (2.2.c.1c) Offside front track rod end ball joint dust cover excessively deteriorated so that it no longer prevents the ingress of dirt (2.2.c.1c) 21 August 2017 [10:15] 21/08/2017 188143206898 188143206898
1 Nearside drive shaft which forms part of the suspension coupling gaiter insecure to the extent that it no longer prevents the ingress of dirt etc (2.4.g.4e) Nearside drive shaft which forms part of the suspension coupling gaiter insecure to the extent that it no longer prevents the ingress of dirt etc (2.4.g.4e) 04 August 2016 [09:26] 04/08/2016 504683270803 504683270803
1 Offside front suspension arm has excessive play in a ball joint (2.4.g.2) Offside front suspension arm has excessive play in a ball joint (2.4.g.2) 04 August 2016 [09:26] 04/08/2016 504683270803 504683270803
1 Brakes imbalanced across an axle (3.7.b.5b) Brakes imbalanced across an axle (3.7.b.5b) 19 August 2015 [11:19] 19/08/2015 460527468413 460527468413
1 Nearside front windscreen washer provides insufficient washer liquid (8.2.3) Nearside front windscreen washer provides insufficient washer liquid (8.2.3) 19 August 2015 [11:19] 19/08/2015 460527468413 460527468413
1 Offside front windscreen washer provides insufficient washer liquid (8.2.3) Offside front windscreen washer provides insufficient washer liquid (8.2.3) 19 August 2015 [11:19] 19/08/2015 460527468413 460527468413
1 Offside rear parking brake recording little or no effort (3.7.b.6a) Offside rear parking brake recording little or no effort (3.7.b.6a) 19 August 2015 [11:19] 19/08/2015 460527468413 460527468413

MOT TEST: 29 August 2017 07:13:27 PASSED
MOT TEST: 29 August 2017 07:13:27 PASSED

This test (824687444337) was completed on the 29 August 2017 07:13:27 and PASSED the requirements for a valid MOT with 1 comments.

This test (824687444337) was completed on the 29 August 2017 07:13:27 and PASSED the requirements for a valid MOT with 1 comments.

Recorded mileage: 54,874

Recorded mileage: 54,874


ADVISORY


MOT TEST: 21 August 2017 10:15:30 FAILED
MOT TEST: 21 August 2017 10:15:30 FAILED

This test (188143206898) was completed on the 21 August 2017 10:15:30 and FAILED the requirements for a valid MOT with 6 comments.

This test (188143206898) was completed on the 21 August 2017 10:15:30 and FAILED the requirements for a valid MOT with 6 comments.

Recorded mileage: 54,867

Recorded mileage: 54,867


ADVISORY

FAIL


MOT TEST: 04 August 2016 12:11:26 PASSED
MOT TEST: 04 August 2016 12:11:26 PASSED

This test (651995158104) was completed on the 04 August 2016 12:11:26 and PASSED the requirements for a valid MOT with 0 comments.

This test (651995158104) was completed on the 04 August 2016 12:11:26 and PASSED the requirements for a valid MOT with 0 comments.

Recorded mileage: 0

Recorded mileage: 0


MOT TEST: 04 August 2016 09:26:37 FAILED
MOT TEST: 04 August 2016 09:26:37 FAILED

This test (504683270803) was completed on the 04 August 2016 09:26:37 and FAILED the requirements for a valid MOT with 4 comments.

This test (504683270803) was completed on the 04 August 2016 09:26:37 and FAILED the requirements for a valid MOT with 4 comments.

Recorded mileage: 0

Recorded mileage: 0


FAIL


MOT TEST: 28 August 2015 13:43:53 PASSED
MOT TEST: 28 August 2015 13:43:53 PASSED

This test (521205792838) was completed on the 28 August 2015 13:43:53 and PASSED the requirements for a valid MOT with 0 comments.

This test (521205792838) was completed on the 28 August 2015 13:43:53 and PASSED the requirements for a valid MOT with 0 comments.

Recorded mileage: 54,177

Recorded mileage: 54,177


MOT TEST: 19 August 2015 11:19:27 FAILED
MOT TEST: 19 August 2015 11:19:27 FAILED

This test (460527468413) was completed on the 19 August 2015 11:19:27 and FAILED the requirements for a valid MOT with 5 comments.

This test (460527468413) was completed on the 19 August 2015 11:19:27 and FAILED the requirements for a valid MOT with 5 comments.

Recorded mileage: 54,170

Recorded mileage: 54,170


FAIL


MOT TEST: 21 August 2014 11:02:56 PASSED
MOT TEST: 21 August 2014 11:02:56 PASSED

This test (396803434486) was completed on the 21 August 2014 11:02:56 and PASSED the requirements for a valid MOT with 0 comments.

This test (396803434486) was completed on the 21 August 2014 11:02:56 and PASSED the requirements for a valid MOT with 0 comments.

Recorded mileage: 53,941

Recorded mileage: 53,941


MOT TEST: 12 August 2013 15:25:42 PASSED
MOT TEST: 12 August 2013 15:25:42 PASSED

This test (575274723299) was completed on the 12 August 2013 15:25:42 and PASSED the requirements for a valid MOT with 0 comments.

This test (575274723299) was completed on the 12 August 2013 15:25:42 and PASSED the requirements for a valid MOT with 0 comments.

Recorded mileage: 53,252

Recorded mileage: 53,252