XOW 679J


XOW679J is registered to a White 1971, Morris Minor traveller with a Petrol engine. It Failed its most recent MOT Test on the 23 November 2009

4 unique faults (4 Total) reported in its MOT History (7 Tests).

0 common/recurring faults.

71% (5) MOT Pass Rate and a 29% (2) MOT Failure Rate.

19,689 recorded miles.

XOW 679J


XOW679J is registered to a White 1971, Morris Minor traveller with a Petrol engine. It Failed its most recent MOT Test on the 23 November 2009

4 unique faults (4 Total) reported in its MOT History (7 Tests).

0 common/recurring faults.

71% (5) MOT Pass Rate and a 29% (2) MOT Failure Rate.

19,689 recorded miles.

MOT PASS/Failure rate for XOW 679J

all MOT test results for XOW 679J represented as a percentage
MOT PASS/Failure rate for XOW 679J
all MOT test results for XOW 679J represented as a percentage

PERCENTAGE OF VEHICLE FAULTS WITH XOW 679J

ALL REPORTED FAULTS, DISPLAYED BY PERCENTAGE OF OCCURRENCE DURING ALL MOT TESTS
PERCENTAGE OF VEHICLE FAULTS WITH XOW 679J
ALL REPORTED FAULTS, DISPLAYED BY PERCENTAGE OF OCCURRENCE DURING ALL MOT TESTS
ADVISORY

FAIL

XOW 679J annual Faults by type

ALL REPORTED FAULTS, DISPLAYED over time and categorised by type
XOW 679J annual Faults by type
ALL REPORTED FAULTS, DISPLAYED over time and categorised by type

ALL XOW 679J ADVISORIES [2]

ALL ADVISORIES, ORDERED by OCCURRENCE DURING XOW 679J's MOT HISTORY
ALL XOW 679J ADVISORIES [2]
ALL ADVISORIES, ORDERED by OCCURRENCE DURING XOW 679J's MOT HISTORY
Advisory Faults | source www.vehiclestats.co.uk
Fault Fault Test Date Test Date/Time Reference MOT Test Reference
1 Offside front leaf spring shackle bracket corroded but not seriously weakened (2.4.b.6d) Offside front leaf spring shackle bracket corroded but not seriously weakened (2.4.b.6d) 23 November 2009 [11:13] 23/11/2009 410337829397 410337829397
1 Nearside rear leaf spring shackle bracket corroded but not seriously weakened (2.4.b.6d) Nearside rear leaf spring shackle bracket corroded but not seriously weakened (2.4.b.6d) 23 November 2009 [11:13] 23/11/2009 410337829397 410337829397

ALL XOW 679J Failure Faults [2]

ALL Failure faults, ORDERED by OCCURRENCE DURING XOW 679J's MOT HISTORY
ALL XOW 679J Failure Faults [2]
ALL Failure faults, ORDERED by OCCURRENCE DURING XOW 679J's MOT HISTORY
Fail Faults | source www.vehiclestats.co.uk
Fault Fault Test Date Test Date/Time Reference MOT Test Reference
1 Nearside steering rack gaiter split (2.2.d.2d) Nearside steering rack gaiter split (2.2.d.2d) 03 December 2007 [14:59] 03/12/2007 502497837399 502497837399
1 Offside rear vehicle structure has excessive corrosion, seriously affecting its strength within 30cm of the body mountings (6.1.b.2) Offside rear vehicle structure has excessive corrosion, seriously affecting its strength within 30cm of the body mountings (6.1.b.2) 25 November 2005 [08:42] 25/11/2005 834709525333 834709525333

MOT TEST: 23 November 2009 11:13:47 PASSED
MOT TEST: 23 November 2009 11:13:47 PASSED

This test (410337829397) was completed on the 23 November 2009 11:13:47 and PASSED the requirements for a valid MOT with 2 comments.

This test (410337829397) was completed on the 23 November 2009 11:13:47 and PASSED the requirements for a valid MOT with 2 comments.

Recorded mileage: 19,689

Recorded mileage: 19,689


ADVISORY


MOT TEST: 01 December 2008 10:50:55 PASSED
MOT TEST: 01 December 2008 10:50:55 PASSED

This test (270256538387) was completed on the 01 December 2008 10:50:55 and PASSED the requirements for a valid MOT with 0 comments.

This test (270256538387) was completed on the 01 December 2008 10:50:55 and PASSED the requirements for a valid MOT with 0 comments.

Recorded mileage: 19,597

Recorded mileage: 19,597


MOT TEST: 04 December 2007 08:11:34 PASSED
MOT TEST: 04 December 2007 08:11:34 PASSED

This test (322018337382) was completed on the 04 December 2007 08:11:34 and PASSED the requirements for a valid MOT with 0 comments.

This test (322018337382) was completed on the 04 December 2007 08:11:34 and PASSED the requirements for a valid MOT with 0 comments.

Recorded mileage: 19,255

Recorded mileage: 19,255


MOT TEST: 03 December 2007 14:59:30 FAILED
MOT TEST: 03 December 2007 14:59:30 FAILED

This test (502497837399) was completed on the 03 December 2007 14:59:30 and FAILED the requirements for a valid MOT with 1 comments.

This test (502497837399) was completed on the 03 December 2007 14:59:30 and FAILED the requirements for a valid MOT with 1 comments.

Recorded mileage: 19,255

Recorded mileage: 19,255


FAIL


MOT TEST: 28 November 2006 14:01:17 PASSED
MOT TEST: 28 November 2006 14:01:17 PASSED

This test (872342336372) was completed on the 28 November 2006 14:01:17 and PASSED the requirements for a valid MOT with 0 comments.

This test (872342336372) was completed on the 28 November 2006 14:01:17 and PASSED the requirements for a valid MOT with 0 comments.

Recorded mileage: 18,735

Recorded mileage: 18,735


MOT TEST: 29 November 2005 15:58:07 PASSED
MOT TEST: 29 November 2005 15:58:07 PASSED

This test (192753935369) was completed on the 29 November 2005 15:58:07 and PASSED the requirements for a valid MOT with 0 comments.

This test (192753935369) was completed on the 29 November 2005 15:58:07 and PASSED the requirements for a valid MOT with 0 comments.

Recorded mileage: 18,314

Recorded mileage: 18,314


MOT TEST: 25 November 2005 08:42:36 FAILED
MOT TEST: 25 November 2005 08:42:36 FAILED

This test (834709525333) was completed on the 25 November 2005 08:42:36 and FAILED the requirements for a valid MOT with 1 comments.

This test (834709525333) was completed on the 25 November 2005 08:42:36 and FAILED the requirements for a valid MOT with 1 comments.

Recorded mileage: 18,308

Recorded mileage: 18,308


FAIL