XOY 680H


XOY680H is registered to a Green 1969, Morris Mini 1000 with a Petrol engine. It Failed its most recent MOT Test on the 02 June 2009

28 unique faults (34 Total) reported in its MOT History (6 Tests).

6 common/recurring faults, the most frequent (2 times) is: Centre Front Exhaust has a minor leak of exhaust gases (7.1.2).

33% (2) MOT Pass Rate and a 67% (4) MOT Failure Rate.

43,000 recorded miles.

XOY 680H


XOY680H is registered to a Green 1969, Morris Mini 1000 with a Petrol engine. It Failed its most recent MOT Test on the 02 June 2009

28 unique faults (34 Total) reported in its MOT History (6 Tests).

6 common/recurring faults, the most frequent (2 times) is: Centre Front Exhaust has a minor leak of exhaust gases (7.1.2).

33% (2) MOT Pass Rate and a 67% (4) MOT Failure Rate.

43,000 recorded miles.

MOT PASS/Failure rate for XOY 680H

all MOT test results for XOY 680H represented as a percentage
MOT PASS/Failure rate for XOY 680H
all MOT test results for XOY 680H represented as a percentage

PERCENTAGE OF VEHICLE FAULTS WITH XOY 680H

ALL REPORTED FAULTS, DISPLAYED BY PERCENTAGE OF OCCURRENCE DURING ALL MOT TESTS
PERCENTAGE OF VEHICLE FAULTS WITH XOY 680H
ALL REPORTED FAULTS, DISPLAYED BY PERCENTAGE OF OCCURRENCE DURING ALL MOT TESTS
ADVISORY

FAIL

USER ENTERED

XOY 680H annual Faults by type

ALL REPORTED FAULTS, DISPLAYED over time and categorised by type
XOY 680H annual Faults by type
ALL REPORTED FAULTS, DISPLAYED over time and categorised by type

RECURRING FAULTS WITH XOY 680H

FAULTS THAT HAVE OCCURED MORE THAN ONCE DURING XOY 680H's MOT HISTORY
RECURRING FAULTS WITH XOY 680H
FAULTS THAT HAVE OCCURED MORE THAN ONCE DURING XOY 680H's MOT HISTORY
Fault Fault Test Date Test Date/Time Reference MOT Test Reference
2 Centre front exhaust has a minor leak of exhaust gases (7.1.2) Centre front exhaust has a minor leak of exhaust gases (7.1.2) 02 June 2009 [09:01] 02/06/2009 27 May 2009 [09:44] 27/05/2009 201773559120 201773559120 510797449181 510797449181
2 Service brake: efficiency below requirements (3.7.b.7) Service brake: efficiency below requirements (3.7.b.7) 27 May 2009 [09:44] 27/05/2009 21 May 2009 [16:45] 21/05/2009 510797449181 510797449181 214721349135 214721349135
2 Offside & nearside indicator slow flash on idle with headlamp on Offside & nearside indicator slow flash on idle with headlamp on 27 May 2009 [09:44] 27/05/2009 21 May 2009 [16:45] 21/05/2009 510797449181 510797449181 214721349135 214721349135
2 Nearside rear parking brake recording little or no effort (3.7.b.6a) Nearside rear parking brake recording little or no effort (3.7.b.6a) 18 April 2007 [14:45] 18/04/2007 12 February 2007 [17:01] 12/02/2007 233318607405 233318607405 161403347450 161403347450
2 Offside rear subframe mounting prescribed area is excessively corroded (2.4.a.3) Offside rear subframe mounting prescribed area is excessively corroded (2.4.a.3) 18 April 2007 [14:45] 18/04/2007 12 February 2007 [17:01] 12/02/2007 233318607405 233318607405 161403347450 161403347450
2 Windscreen has damage to an area less than a 10mm circle within zone 'a' (8.3.1a) Windscreen has damage to an area less than a 10mm circle within zone 'a' (8.3.1a) 18 April 2007 [14:45] 18/04/2007 12 February 2007 [17:01] 12/02/2007 233318607405 233318607405 161403347450 161403347450

ALL XOY 680H ADVISORIES [6]

ALL ADVISORIES, ORDERED by OCCURRENCE DURING XOY 680H's MOT HISTORY
ALL XOY 680H ADVISORIES [6]
ALL ADVISORIES, ORDERED by OCCURRENCE DURING XOY 680H's MOT HISTORY
Advisory Faults | source www.vehiclestats.co.uk
Fault Fault Test Date Test Date/Time Reference MOT Test Reference
2 Centre front exhaust has a minor leak of exhaust gases (7.1.2) Centre front exhaust has a minor leak of exhaust gases (7.1.2) 02 June 2009 [09:01] 02/06/2009 27 May 2009 [09:44] 27/05/2009 201773559120 201773559120 510797449181 510797449181
2 Windscreen has damage to an area less than a 10mm circle within zone 'a' (8.3.1a) Windscreen has damage to an area less than a 10mm circle within zone 'a' (8.3.1a) 18 April 2007 [14:45] 18/04/2007 12 February 2007 [17:01] 12/02/2007 233318607405 233318607405 161403347450 161403347450
1 Offside rear brake pipe slightly chafed (3.6.b.2c) Offside rear brake pipe slightly chafed (3.6.b.2c) 21 May 2009 [16:45] 21/05/2009 214721349135 214721349135
1 Windscreen has damage to an area less than a 40mm circle outside zone 'a' (8.3.1d) Windscreen has damage to an area less than a 40mm circle outside zone 'a' (8.3.1d) 18 April 2007 [14:45] 18/04/2007 233318607405 233318607405

ALL XOY 680H Failure Faults [23]

ALL Failure faults, ORDERED by OCCURRENCE DURING XOY 680H's MOT HISTORY
ALL XOY 680H Failure Faults [23]
ALL Failure faults, ORDERED by OCCURRENCE DURING XOY 680H's MOT HISTORY
Fail Faults | source www.vehiclestats.co.uk
Fault Fault Test Date Test Date/Time Reference MOT Test Reference
2 Service brake: efficiency below requirements (3.7.b.7) Service brake: efficiency below requirements (3.7.b.7) 27 May 2009 [09:44] 27/05/2009 21 May 2009 [16:45] 21/05/2009 510797449181 510797449181 214721349135 214721349135
2 Nearside rear parking brake recording little or no effort (3.7.b.6a) Nearside rear parking brake recording little or no effort (3.7.b.6a) 18 April 2007 [14:45] 18/04/2007 12 February 2007 [17:01] 12/02/2007 233318607405 233318607405 161403347450 161403347450
2 Offside rear subframe mounting prescribed area is excessively corroded (2.4.a.3) Offside rear subframe mounting prescribed area is excessively corroded (2.4.a.3) 18 April 2007 [14:45] 18/04/2007 12 February 2007 [17:01] 12/02/2007 233318607405 233318607405 161403347450 161403347450
1 Hazard warning tell tale not working correctly (1.4.b.1e) Hazard warning tell tale not working correctly (1.4.b.1e) 21 May 2009 [16:45] 21/05/2009 214721349135 214721349135
1 Nearside front headlamp aim too low (1.8) Nearside front headlamp aim too low (1.8) 21 May 2009 [16:45] 21/05/2009 214721349135 214721349135
1 Offside front windscreen has damage to an area in excess of a 10mm circle within zone 'a' (8.3.1a) Offside front windscreen has damage to an area in excess of a 10mm circle within zone 'a' (8.3.1a) 21 May 2009 [16:45] 21/05/2009 214721349135 214721349135
1 Offside front seat belt has a cut which has significantly weakened the webbing (5.2.2a) Offside front seat belt has a cut which has significantly weakened the webbing (5.2.2a) 21 May 2009 [16:45] 21/05/2009 214721349135 214721349135
1 Front registration plate deteriorated (6.3.1d) Front registration plate deteriorated (6.3.1d) 21 May 2009 [16:45] 21/05/2009 214721349135 214721349135
1 Offside front lower suspension arm has excessive play in a ball joint (2.4.g.2) Offside front lower suspension arm has excessive play in a ball joint (2.4.g.2) 21 May 2009 [16:45] 21/05/2009 214721349135 214721349135
1 Centre front exhaust has a major leak of exhaust gases (7.1.2) Centre front exhaust has a major leak of exhaust gases (7.1.2) 21 May 2009 [16:45] 21/05/2009 214721349135 214721349135
1 Windscreen washer provides insufficient washer liquid (8.2.3) Windscreen washer provides insufficient washer liquid (8.2.3) 18 April 2007 [14:45] 18/04/2007 233318607405 233318607405
1 Nearside brake cable has restricted free movement (3.5.1k) Nearside brake cable has restricted free movement (3.5.1k) 18 April 2007 [14:45] 18/04/2007 233318607405 233318607405
1 Offside rear brake binding (3.7.b.1) Offside rear brake binding (3.7.b.1) 18 April 2007 [14:45] 18/04/2007 233318607405 233318607405
1 Nearside lower front suspension has a suspension lower ball joint securing nut not locked (2.5.b.1a) Nearside lower front suspension has a suspension lower ball joint securing nut not locked (2.5.b.1a) 18 April 2007 [14:45] 18/04/2007 233318607405 233318607405
1 Nearside rear sub-frame corroded and seriously weakened (2.4.g.1) Nearside rear sub-frame corroded and seriously weakened (2.4.g.1) 12 February 2007 [17:01] 12/02/2007 161403347450 161403347450
1 Nearside brake linkage has restricted free movement (3.5.1k) Nearside brake linkage has restricted free movement (3.5.1k) 12 February 2007 [17:01] 12/02/2007 161403347450 161403347450
1 Front exhaust has a major leak of exhaust gases (7.1.2) Front exhaust has a major leak of exhaust gases (7.1.2) 12 February 2007 [17:01] 12/02/2007 161403347450 161403347450
1 Nearside outer track rod end ball joint has excessive play (2.2.b.1f) Nearside outer track rod end ball joint has excessive play (2.2.b.1f) 12 February 2007 [17:01] 12/02/2007 161403347450 161403347450
1 Nearside front suspension has excessive play in a lower suspension ball joint (2.5.b.1a) Nearside front suspension has excessive play in a lower suspension ball joint (2.5.b.1a) 12 February 2007 [17:01] 12/02/2007 161403347450 161403347450
1 Parking brake: efficiency below requirements (3.7.b.7) Parking brake: efficiency below requirements (3.7.b.7) 12 February 2007 [17:01] 12/02/2007 161403347450 161403347450

ALL XOY 680H User Entered Faults [5]

ALL User Entered faults, ORDERED by OCCURRENCE DURING XOY 680H's MOT HISTORY
ALL XOY 680H User Entered Faults [5]
ALL User Entered faults, ORDERED by OCCURRENCE DURING XOY 680H's MOT HISTORY
Fail Faults | source www.vehiclestats.co.uk
Fault Fault Test Date Test Date/Time Reference MOT Test Reference
2 Offside & nearside indicator slow flash on idle with headlamp on Offside & nearside indicator slow flash on idle with headlamp on 27 May 2009 [09:44] 27/05/2009 21 May 2009 [16:45] 21/05/2009 510797449181 510797449181 214721349135 214721349135
1 Both wiper arms slightly weak Both wiper arms slightly weak 18 April 2007 [14:45] 18/04/2007 233318607405 233318607405
1 Drivers door loose on top hinge Drivers door loose on top hinge 18 April 2007 [14:45] 18/04/2007 233318607405 233318607405
1 Both wiper blades slightly loose on arms Both wiper blades slightly loose on arms 12 February 2007 [17:01] 12/02/2007 161403347450 161403347450

MOT TEST: 02 June 2009 09:01:55 PASSED
MOT TEST: 02 June 2009 09:01:55 PASSED

This test (201773559120) was completed on the 02 June 2009 09:01:55 and PASSED the requirements for a valid MOT with 1 comments.

This test (201773559120) was completed on the 02 June 2009 09:01:55 and PASSED the requirements for a valid MOT with 1 comments.

Recorded mileage: 43,000

Recorded mileage: 43,000


ADVISORY


MOT TEST: 27 May 2009 09:44:09 FAILED
MOT TEST: 27 May 2009 09:44:09 FAILED

This test (510797449181) was completed on the 27 May 2009 09:44:09 and FAILED the requirements for a valid MOT with 3 comments.

This test (510797449181) was completed on the 27 May 2009 09:44:09 and FAILED the requirements for a valid MOT with 3 comments.

Recorded mileage: 43,000

Recorded mileage: 43,000


ADVISORY

FAIL

USER ENTERED


MOT TEST: 21 May 2009 16:45:20 FAILED
MOT TEST: 21 May 2009 16:45:20 FAILED

This test (214721349135) was completed on the 21 May 2009 16:45:20 and FAILED the requirements for a valid MOT with 10 comments.

This test (214721349135) was completed on the 21 May 2009 16:45:20 and FAILED the requirements for a valid MOT with 10 comments.

Recorded mileage: 43,000

Recorded mileage: 43,000


ADVISORY

FAIL

USER ENTERED


MOT TEST: 24 April 2007 15:25:34 PASSED
MOT TEST: 24 April 2007 15:25:34 PASSED

This test (944574017180) was completed on the 24 April 2007 15:25:34 and PASSED the requirements for a valid MOT with 0 comments.

This test (944574017180) was completed on the 24 April 2007 15:25:34 and PASSED the requirements for a valid MOT with 0 comments.

Recorded mileage: 43,000

Recorded mileage: 43,000


MOT TEST: 18 April 2007 14:45:45 FAILED
MOT TEST: 18 April 2007 14:45:45 FAILED

This test (233318607405) was completed on the 18 April 2007 14:45:45 and FAILED the requirements for a valid MOT with 10 comments.

This test (233318607405) was completed on the 18 April 2007 14:45:45 and FAILED the requirements for a valid MOT with 10 comments.

Recorded mileage: 43,000

Recorded mileage: 43,000


ADVISORY

FAIL

USER ENTERED


MOT TEST: 12 February 2007 17:01:17 FAILED
MOT TEST: 12 February 2007 17:01:17 FAILED

This test (161403347450) was completed on the 12 February 2007 17:01:17 and FAILED the requirements for a valid MOT with 10 comments.

This test (161403347450) was completed on the 12 February 2007 17:01:17 and FAILED the requirements for a valid MOT with 10 comments.

Recorded mileage: 43,000

Recorded mileage: 43,000


ADVISORY

FAIL

USER ENTERED