XPX 249F


XPX249F is registered to a Blue 1968, Morris Minor 1000 with a Petrol engine. It Failed its most recent MOT Test on the 29 May 2007

9 unique faults (9 Total) reported in its MOT History (4 Tests).

0 common/recurring faults.

50% (2) MOT Pass Rate and a 50% (2) MOT Failure Rate.

59,623 recorded miles.

XPX 249F


XPX249F is registered to a Blue 1968, Morris Minor 1000 with a Petrol engine. It Failed its most recent MOT Test on the 29 May 2007

9 unique faults (9 Total) reported in its MOT History (4 Tests).

0 common/recurring faults.

50% (2) MOT Pass Rate and a 50% (2) MOT Failure Rate.

59,623 recorded miles.

MOT PASS/Failure rate for XPX 249F

all MOT test results for XPX 249F represented as a percentage
MOT PASS/Failure rate for XPX 249F
all MOT test results for XPX 249F represented as a percentage

PERCENTAGE OF VEHICLE FAULTS WITH XPX 249F

ALL REPORTED FAULTS, DISPLAYED BY PERCENTAGE OF OCCURRENCE DURING ALL MOT TESTS
PERCENTAGE OF VEHICLE FAULTS WITH XPX 249F
ALL REPORTED FAULTS, DISPLAYED BY PERCENTAGE OF OCCURRENCE DURING ALL MOT TESTS
FAIL

XPX 249F annual Faults by type

ALL REPORTED FAULTS, DISPLAYED over time and categorised by type
XPX 249F annual Faults by type
ALL REPORTED FAULTS, DISPLAYED over time and categorised by type

ALL XPX 249F Failure Faults [9]

ALL Failure faults, ORDERED by OCCURRENCE DURING XPX 249F's MOT HISTORY
ALL XPX 249F Failure Faults [9]
ALL Failure faults, ORDERED by OCCURRENCE DURING XPX 249F's MOT HISTORY
Fail Faults | source www.vehiclestats.co.uk
Fault Fault Test Date Test Date/Time Reference MOT Test Reference
1 Nearside headlamp not working on dipped beam (1.7.5a) Nearside headlamp not working on dipped beam (1.7.5a) 18 May 2007 [14:40] 18/05/2007 933878137168 933878137168
1 Nearside rear parking brake recording little or no effort (3.7.b.6a) Nearside rear parking brake recording little or no effort (3.7.b.6a) 18 May 2007 [14:40] 18/05/2007 933878137168 933878137168
1 Parking brake: efficiency below requirements (3.7.c.1b) Parking brake: efficiency below requirements (3.7.c.1b) 18 May 2007 [14:40] 18/05/2007 933878137168 933878137168
1 Nearside front brake binding (3.7.b.1) Nearside front brake binding (3.7.b.1) 18 May 2007 [14:40] 18/05/2007 933878137168 933878137168
1 Nearside rear brake binding (3.7.b.1) Nearside rear brake binding (3.7.b.1) 18 May 2007 [14:40] 18/05/2007 933878137168 933878137168
1 Front brake application uneven (3.7.b.2) Front brake application uneven (3.7.b.2) 18 May 2007 [14:40] 18/05/2007 933878137168 933878137168
1 Offside rear suspension spring mounting prescribed area is excessively corroded (2.4.a.3) Offside rear suspension spring mounting prescribed area is excessively corroded (2.4.a.3) 18 May 2007 [14:40] 18/05/2007 933878137168 933878137168
1 Offside headlamp not working on dipped beam (1.7.5a) Offside headlamp not working on dipped beam (1.7.5a) 28 April 2006 [11:17] 28/04/2006 282168716470 282168716470
1 Horn not working (1.6.2a) Horn not working (1.6.2a) 28 April 2006 [11:17] 28/04/2006 282168716470 282168716470

MOT TEST: 29 May 2007 16:03:56 PASSED
MOT TEST: 29 May 2007 16:03:56 PASSED

This test (834089847188) was completed on the 29 May 2007 16:03:56 and PASSED the requirements for a valid MOT with 0 comments.

This test (834089847188) was completed on the 29 May 2007 16:03:56 and PASSED the requirements for a valid MOT with 0 comments.

Recorded mileage: 59,623

Recorded mileage: 59,623


MOT TEST: 18 May 2007 14:40:48 FAILED
MOT TEST: 18 May 2007 14:40:48 FAILED

This test (933878137168) was completed on the 18 May 2007 14:40:48 and FAILED the requirements for a valid MOT with 7 comments.

This test (933878137168) was completed on the 18 May 2007 14:40:48 and FAILED the requirements for a valid MOT with 7 comments.

Recorded mileage: 59,621

Recorded mileage: 59,621


FAIL


MOT TEST: 28 April 2006 14:23:28 PASSED
MOT TEST: 28 April 2006 14:23:28 PASSED

This test (432858816139) was completed on the 28 April 2006 14:23:28 and PASSED the requirements for a valid MOT with 0 comments.

This test (432858816139) was completed on the 28 April 2006 14:23:28 and PASSED the requirements for a valid MOT with 0 comments.

Recorded mileage: 59,444

Recorded mileage: 59,444


MOT TEST: 28 April 2006 11:17:06 FAILED
MOT TEST: 28 April 2006 11:17:06 FAILED

This test (282168716470) was completed on the 28 April 2006 11:17:06 and FAILED the requirements for a valid MOT with 2 comments.

This test (282168716470) was completed on the 28 April 2006 11:17:06 and FAILED the requirements for a valid MOT with 2 comments.

Recorded mileage: 59,544

Recorded mileage: 59,544


FAIL