XWL 763


XWL763 is registered to a Black 1955, Morris Minor with a Petrol engine. It Failed its most recent MOT Test on the 16 July 2012

6 unique faults (6 Total) reported in its MOT History (6 Tests).

0 common/recurring faults.

83% (5) MOT Pass Rate and a 17% (1) MOT Failure Rate.

90,102 recorded miles.

XWL 763


XWL763 is registered to a Black 1955, Morris Minor with a Petrol engine. It Failed its most recent MOT Test on the 16 July 2012

6 unique faults (6 Total) reported in its MOT History (6 Tests).

0 common/recurring faults.

83% (5) MOT Pass Rate and a 17% (1) MOT Failure Rate.

90,102 recorded miles.

MOT PASS/Failure rate for XWL 763

all MOT test results for XWL 763 represented as a percentage
MOT PASS/Failure rate for XWL 763
all MOT test results for XWL 763 represented as a percentage

PERCENTAGE OF VEHICLE FAULTS WITH XWL 763

ALL REPORTED FAULTS, DISPLAYED BY PERCENTAGE OF OCCURRENCE DURING ALL MOT TESTS
PERCENTAGE OF VEHICLE FAULTS WITH XWL 763
ALL REPORTED FAULTS, DISPLAYED BY PERCENTAGE OF OCCURRENCE DURING ALL MOT TESTS
ADVISORY

FAIL

USER ENTERED

XWL 763 annual Faults by type

ALL REPORTED FAULTS, DISPLAYED over time and categorised by type
XWL 763 annual Faults by type
ALL REPORTED FAULTS, DISPLAYED over time and categorised by type

ALL XWL 763 ADVISORIES [2]

ALL ADVISORIES, ORDERED by OCCURRENCE DURING XWL 763's MOT HISTORY
ALL XWL 763 ADVISORIES [2]
ALL ADVISORIES, ORDERED by OCCURRENCE DURING XWL 763's MOT HISTORY
Fail Faults | source www.vehiclestats.co.uk
Fault Fault Test Date Test Date/Time Reference MOT Test Reference
1 Offside front lower front suspension has slight play in a lower suspension ball joint (2.5.b.1a) Offside front lower front suspension has slight play in a lower suspension ball joint (2.5.b.1a) 07 June 2007 [17:38] 07/06/2007 683058057114 683058057114
1 Nearside front lower front suspension has slight play in a upper suspension ball joint (2.5.b.1a) Nearside front lower front suspension has slight play in a upper suspension ball joint (2.5.b.1a) 07 June 2007 [17:38] 07/06/2007 683058057114 683058057114

ALL XWL 763 Failure Faults [3]

ALL Failure faults, ORDERED by OCCURRENCE DURING XWL 763's MOT HISTORY
ALL XWL 763 Failure Faults [3]
ALL Failure faults, ORDERED by OCCURRENCE DURING XWL 763's MOT HISTORY
Fail Faults | source www.vehiclestats.co.uk
Fault Fault Test Date Test Date/Time Reference MOT Test Reference
1 Steering wheel weakened by fractures (2.1.1) Steering wheel weakened by fractures (2.1.1) 07 June 2007 [17:38] 07/06/2007 683058057114 683058057114
1 Nearside front upper front suspension locking device missing (2.5.a.4) Nearside front upper front suspension locking device missing (2.5.a.4) 07 June 2007 [17:38] 07/06/2007 683058057114 683058057114
1 Offside front upper front suspension locking device missing (2.5.a.4) Offside front upper front suspension locking device missing (2.5.a.4) 07 June 2007 [17:38] 07/06/2007 683058057114 683058057114

ALL XWL 763 User Entered Faults [1]

ALL User Entered faults, ORDERED by OCCURRENCE DURING XWL 763's MOT HISTORY
ALL XWL 763 User Entered Faults [1]
ALL User Entered faults, ORDERED by OCCURRENCE DURING XWL 763's MOT HISTORY
User Entered Faults | source www.vehiclestats.co.uk
Fault Fault Test Date Test Date/Time Reference MOT Test Reference
1 Front brakes imbalanced.long parking brake travel.fuel and front brake pipe needs more securing, Front brakes imbalanced.long parking brake travel.fuel and front brake pipe needs more securing, 06 May 2006 [09:48] 06/05/2006 513646826193 513646826193

MOT TEST: 16 July 2012 16:43:10 PASSED
MOT TEST: 16 July 2012 16:43:10 PASSED

This test (985308092107) was completed on the 16 July 2012 16:43:10 and PASSED the requirements for a valid MOT with 0 comments.

This test (985308092107) was completed on the 16 July 2012 16:43:10 and PASSED the requirements for a valid MOT with 0 comments.

Recorded mileage: 90,102

Recorded mileage: 90,102


MOT TEST: 12 May 2009 08:30:43 PASSED
MOT TEST: 12 May 2009 08:30:43 PASSED

This test (951692339151) was completed on the 12 May 2009 08:30:43 and PASSED the requirements for a valid MOT with 0 comments.

This test (951692339151) was completed on the 12 May 2009 08:30:43 and PASSED the requirements for a valid MOT with 0 comments.

Recorded mileage: 90,102

Recorded mileage: 90,102


MOT TEST: 04 June 2008 09:37:49 PASSED
MOT TEST: 04 June 2008 09:37:49 PASSED

This test (280476858442) was completed on the 04 June 2008 09:37:49 and PASSED the requirements for a valid MOT with 0 comments.

This test (280476858442) was completed on the 04 June 2008 09:37:49 and PASSED the requirements for a valid MOT with 0 comments.

Recorded mileage: 90,102

Recorded mileage: 90,102


MOT TEST: 08 June 2007 18:26:09 PASSED
MOT TEST: 08 June 2007 18:26:09 PASSED

This test (910379457117) was completed on the 08 June 2007 18:26:09 and PASSED the requirements for a valid MOT with 0 comments.

This test (910379457117) was completed on the 08 June 2007 18:26:09 and PASSED the requirements for a valid MOT with 0 comments.

Recorded mileage: 86,512

Recorded mileage: 86,512


MOT TEST: 07 June 2007 17:38:37 FAILED
MOT TEST: 07 June 2007 17:38:37 FAILED

This test (683058057114) was completed on the 07 June 2007 17:38:37 and FAILED the requirements for a valid MOT with 5 comments.

This test (683058057114) was completed on the 07 June 2007 17:38:37 and FAILED the requirements for a valid MOT with 5 comments.

Recorded mileage: 86,511

Recorded mileage: 86,511


ADVISORY

FAIL


MOT TEST: 06 May 2006 09:48:27 PASSED
MOT TEST: 06 May 2006 09:48:27 PASSED

This test (513646826193) was completed on the 06 May 2006 09:48:27 and PASSED the requirements for a valid MOT with 1 comments.

This test (513646826193) was completed on the 06 May 2006 09:48:27 and PASSED the requirements for a valid MOT with 1 comments.

Recorded mileage: 84,357

Recorded mileage: 84,357


USER ENTERED