XYJ 169A


XYJ169A is registered to a Grey 1963, Morris 6 cwt van with a Petrol engine. It Failed its most recent MOT Test on the 15 December 2008

10 unique faults (10 Total) reported in its MOT History (6 Tests).

0 common/recurring faults.

67% (4) MOT Pass Rate and a 33% (2) MOT Failure Rate.

91,364 recorded miles.

XYJ 169A


XYJ169A is registered to a Grey 1963, Morris 6 cwt van with a Petrol engine. It Failed its most recent MOT Test on the 15 December 2008

10 unique faults (10 Total) reported in its MOT History (6 Tests).

0 common/recurring faults.

67% (4) MOT Pass Rate and a 33% (2) MOT Failure Rate.

91,364 recorded miles.

MOT PASS/Failure rate for XYJ 169A

all MOT test results for XYJ 169A represented as a percentage
MOT PASS/Failure rate for XYJ 169A
all MOT test results for XYJ 169A represented as a percentage

PERCENTAGE OF VEHICLE FAULTS WITH XYJ 169A

ALL REPORTED FAULTS, DISPLAYED BY PERCENTAGE OF OCCURRENCE DURING ALL MOT TESTS
PERCENTAGE OF VEHICLE FAULTS WITH XYJ 169A
ALL REPORTED FAULTS, DISPLAYED BY PERCENTAGE OF OCCURRENCE DURING ALL MOT TESTS
FAIL

USER ENTERED

PASS WITH RECTIFICATION

XYJ 169A annual Faults by type

ALL REPORTED FAULTS, DISPLAYED over time and categorised by type
XYJ 169A annual Faults by type
ALL REPORTED FAULTS, DISPLAYED over time and categorised by type

ALL XYJ 169A Failure Faults [4]

ALL Failure faults, ORDERED by OCCURRENCE DURING XYJ 169A's MOT HISTORY
ALL XYJ 169A Failure Faults [4]
ALL Failure faults, ORDERED by OCCURRENCE DURING XYJ 169A's MOT HISTORY
Fail Faults | source www.vehiclestats.co.uk
Fault Fault Test Date Test Date/Time Reference MOT Test Reference
1 Horn not working (1.6.2a) Horn not working (1.6.2a) 08 December 2008 [12:06] 08/12/2008 760373648363 760373648363
1 Offside rear rear parking brake recording little or no effort (3.7.b.6a) Offside rear rear parking brake recording little or no effort (3.7.b.6a) 14 November 2006 [13:00] 14/11/2006 183318416359 183318416359
1 Offside parking brake not fitted on at least two wheels (3.1.1) Offside parking brake not fitted on at least two wheels (3.1.1) 14 November 2006 [13:00] 14/11/2006 183318416359 183318416359
1 Parking brake: efficiency below requirements (3.7.b.7) Parking brake: efficiency below requirements (3.7.b.7) 14 November 2006 [13:00] 14/11/2006 183318416359 183318416359

ALL XYJ 169A User Entered Faults [2]

ALL User Entered faults, ORDERED by OCCURRENCE DURING XYJ 169A's MOT HISTORY
ALL XYJ 169A User Entered Faults [2]
ALL User Entered faults, ORDERED by OCCURRENCE DURING XYJ 169A's MOT HISTORY
User Entered Faults | source www.vehiclestats.co.uk
Fault Fault Test Date Test Date/Time Reference MOT Test Reference
1 Drivers door hinge worn Drivers door hinge worn 17 November 2006 [09:10] 17/11/2006 454061726382 454061726382
1 Driver door hinge worn Driver door hinge worn 14 November 2006 [13:00] 14/11/2006 183318416359 183318416359

ALL XYJ 169A Pass With Rectification Faults [4]

ALL Pass With Rectification faults, ORDERED by OCCURRENCE DURING XYJ 169A's MOT HISTORY
ALL XYJ 169A Pass With Rectification Faults [4]
ALL Pass With Rectification faults, ORDERED by OCCURRENCE DURING XYJ 169A's MOT HISTORY
Pass With Rectification Faults | source www.vehiclestats.co.uk
Fault Fault Test Date Test Date/Time Reference MOT Test Reference
1 Nearside registration plate lamp not working (1.1.5c) Nearside registration plate lamp not working (1.1.5c) 14 November 2006 [13:00] 14/11/2006 183318416359 183318416359
1 Nearside stop lamp remains on when the brakes are released (1.2.1e) Nearside stop lamp remains on when the brakes are released (1.2.1e) 14 November 2006 [13:00] 14/11/2006 183318416359 183318416359
1 Nearside rear tyre has a lump, caused by separation or partial failure of its structure (4.1.d.1b) Nearside rear tyre has a lump, caused by separation or partial failure of its structure (4.1.d.1b) 14 November 2006 [13:00] 14/11/2006 183318416359 183318416359
1 Offside rear tyre has a lump, caused by separation or partial failure of its structure (4.1.d.1b) Offside rear tyre has a lump, caused by separation or partial failure of its structure (4.1.d.1b) 14 November 2006 [13:00] 14/11/2006 183318416359 183318416359

MOT TEST: 15 December 2008 15:59:12 PASSED
MOT TEST: 15 December 2008 15:59:12 PASSED

This test (441760058344) was completed on the 15 December 2008 15:59:12 and PASSED the requirements for a valid MOT with 0 comments.

This test (441760058344) was completed on the 15 December 2008 15:59:12 and PASSED the requirements for a valid MOT with 0 comments.

Recorded mileage: 91,364

Recorded mileage: 91,364


MOT TEST: 08 December 2008 12:06:51 FAILED
MOT TEST: 08 December 2008 12:06:51 FAILED

This test (760373648363) was completed on the 08 December 2008 12:06:51 and FAILED the requirements for a valid MOT with 1 comments.

This test (760373648363) was completed on the 08 December 2008 12:06:51 and FAILED the requirements for a valid MOT with 1 comments.

Recorded mileage: 91,354

Recorded mileage: 91,354


FAIL


MOT TEST: 13 December 2007 09:35:28 PASSED
MOT TEST: 13 December 2007 09:35:28 PASSED

This test (284466747374) was completed on the 13 December 2007 09:35:28 and PASSED the requirements for a valid MOT with 0 comments.

This test (284466747374) was completed on the 13 December 2007 09:35:28 and PASSED the requirements for a valid MOT with 0 comments.

Recorded mileage: 90,699

Recorded mileage: 90,699


MOT TEST: 17 November 2006 09:10:37 PASSED
MOT TEST: 17 November 2006 09:10:37 PASSED

This test (454061726382) was completed on the 17 November 2006 09:10:37 and PASSED the requirements for a valid MOT with 1 comments.

This test (454061726382) was completed on the 17 November 2006 09:10:37 and PASSED the requirements for a valid MOT with 1 comments.

Recorded mileage: 90,007

Recorded mileage: 90,007


USER ENTERED


MOT TEST: 14 November 2006 13:00:50 FAILED
MOT TEST: 14 November 2006 13:00:50 FAILED

This test (183318416359) was completed on the 14 November 2006 13:00:50 and FAILED the requirements for a valid MOT with 8 comments.

This test (183318416359) was completed on the 14 November 2006 13:00:50 and FAILED the requirements for a valid MOT with 8 comments.

Recorded mileage: 90,007

Recorded mileage: 90,007


FAIL

USER ENTERED

PASS WITH RECTIFICATION


MOT TEST: 14 September 2005 09:10:42 PASSED
MOT TEST: 14 September 2005 09:10:42 PASSED

This test (794467255201) was completed on the 14 September 2005 09:10:42 and PASSED the requirements for a valid MOT with 0 comments.

This test (794467255201) was completed on the 14 September 2005 09:10:42 and PASSED the requirements for a valid MOT with 0 comments.

Recorded mileage: 89,721

Recorded mileage: 89,721