YD13 PYH
YD13PYH is registered to a White 2013, Ford Transit with a Diesel engine. It Passed its most recent MOT Test on the Wednesday, 20 March 2024
16 unique faults (21 Total) reported in its MOT History (13 Tests).
5 common/recurring faults, the most frequent (2 times) is: Windscreen damaged but not adversely affecting driver's view (3.2 (a) (i)).
69% (9) MOT Pass Rate and a 31% (4) MOT Failure Rate.
121,906 recorded miles.
YD13 PYH
YD13PYH is registered to a White 2013, Ford Transit with a Diesel engine. It Passed its most recent MOT Test on the Wednesday, 20 March 2024
16 unique faults (21 Total) reported in its MOT History (13 Tests).
5 common/recurring faults, the most frequent (2 times) is: Windscreen damaged but not adversely affecting driver's view (3.2 (a) (i)).
69% (9) MOT Pass Rate and a 31% (4) MOT Failure Rate.
121,906 recorded miles.
MOT PASS/Failure rate for YD13 PYH
MOT PASS/Failure rate for YD13 PYH
PERCENTAGE OF VEHICLE FAULTS WITH YD13 PYH
PERCENTAGE OF VEHICLE FAULTS WITH YD13 PYH
ADVISORY
FAIL
MINOR
PASS WITH RECTIFICATION
YD13 PYH annual Faults by type
YD13 PYH annual Faults by type
RECURRING FAULTS WITH YD13 PYH
RECURRING FAULTS WITH YD13 PYH
Fault Fault | Test Date Test Date/Time | Reference MOT Test Reference | |
---|---|---|---|
2 | Windscreen damaged but not adversely affecting driver's view (3.2 (a) (i)) Windscreen damaged but not adversely affecting driver's view (3.2 (a) (i)) | Wednesday, 20 March 2024 [17:22] 03/20/2024 Monday, 15 January 2024 [15:15] 01/15/2024 | 361361503235 361361503235 952913639647 952913639647 |
2 | Registration plate lamp inoperative in the case of a single lamp or all lamps (4.7.1 (b) (ii)) Registration plate lamp inoperative in the case of a single lamp or all lamps (4.7.1 (b) (ii)) | Monday, 15 January 2024 [15:15] 01/15/2024 Wednesday, 15 December 2021 [11:33] 12/15/2021 | 952913639647 952913639647 709051470696 709051470696 |
2 | Windscreen damaged but not adversely affecting driver's view in three places (3.2 (a) (i)) Windscreen damaged but not adversely affecting driver's view in three places (3.2 (a) (i)) | Wednesday, 15 December 2021 [15:53] 12/15/2021 Wednesday, 15 December 2021 [11:33] 12/15/2021 | 402853062927 402853062927 709051470696 709051470696 |
2 | Nearside front outer drive shaft joint constant velocity boot severely deteriorated (6.1.7 (g) (i)) Nearside front outer drive shaft joint constant velocity boot severely deteriorated (6.1.7 (g) (i)) | Wednesday, 15 December 2021 [15:53] 12/15/2021 Wednesday, 15 December 2021 [11:33] 12/15/2021 | 402853062927 402853062927 709051470696 709051470696 |
2 | Front wipers smearing widscreen Front wipers smearing widscreen | Thursday, 17 March 2016 [14:22] 03/17/2016 Wednesday, 16 March 2016 [11:11] 03/16/2016 | 318963657884 318963657884 807304964971 807304964971 |
ALL YD13 PYH ADVISORIES [3]
ALL YD13 PYH ADVISORIES [3]
Fault Fault | Test Date Test Date/Time | Reference MOT Test Reference | |
---|---|---|---|
2 | Front wipers smearing widscreen Front wipers smearing widscreen | Thursday, 17 March 2016 [14:22] 03/17/2016 Wednesday, 16 March 2016 [11:11] 03/16/2016 | 318963657884 318963657884 807304964971 807304964971 |
1 | Coolant low Coolant low | Wednesday, 15 December 2021 [11:33] 12/15/2021 | 709051470696 709051470696 |
ALL YD13 PYH Failure Faults [11]
ALL YD13 PYH Failure Faults [11]
Fault Fault | Test Date Test Date/Time | Reference MOT Test Reference | |
---|---|---|---|
2 | Registration plate lamp inoperative in the case of a single lamp or all lamps (4.7.1 (b) (ii)) Registration plate lamp inoperative in the case of a single lamp or all lamps (4.7.1 (b) (ii)) | Monday, 15 January 2024 [15:15] 01/15/2024 Wednesday, 15 December 2021 [11:33] 12/15/2021 | 952913639647 952913639647 709051470696 709051470696 |
1 | Nearside front position lamp not working (4.2.1 (a) (ii)) Nearside front position lamp not working (4.2.1 (a) (ii)) | Monday, 15 January 2024 [15:15] 01/15/2024 | 952913639647 952913639647 |
1 | Offside rear position lamp not working (4.2.1 (a) (ii)) Offside rear position lamp not working (4.2.1 (a) (ii)) | Monday, 15 January 2024 [15:15] 01/15/2024 | 952913639647 952913639647 |
1 | Offside front position lamp not working (4.2.1 (a) (ii)) Offside front position lamp not working (4.2.1 (a) (ii)) | Monday, 15 January 2024 [15:15] 01/15/2024 | 952913639647 952913639647 |
1 | Offside front outer drive shaft joint constant velocity boot split or insecure, no longer prevents the ingress of dirt (6.1.7 (g) (ii)) Offside front outer drive shaft joint constant velocity boot split or insecure, no longer prevents the ingress of dirt (6.1.7 (g) (ii)) | Monday, 15 January 2024 [15:15] 01/15/2024 | 952913639647 952913639647 |
1 | Offside stop lamp(s) not working (4.3.1 (a) (ii)) Offside stop lamp(s) not working (4.3.1 (a) (ii)) | Monday, 15 January 2024 [15:15] 01/15/2024 | 952913639647 952913639647 |
1 | Offside rear direction indicator incorrect colour (4.4.3 (a)) Offside rear direction indicator incorrect colour (4.4.3 (a)) | Wednesday, 15 December 2021 [11:33] 12/15/2021 | 709051470696 709051470696 |
1 | Front position lamp not working both (4.2.1 (a) (ii)) Front position lamp not working both (4.2.1 (a) (ii)) | Wednesday, 15 December 2021 [11:33] 12/15/2021 | 709051470696 709051470696 |
1 | Main beam 'tell-tale' not working (1.7.4c) Main beam 'tell-tale' not working (1.7.4c) | Wednesday, 16 March 2016 [11:11] 03/16/2016 | 807304964971 807304964971 |
1 | Offside rear rear position lamp(s) not working (1.1.a.3b) Offside rear rear position lamp(s) not working (1.1.a.3b) | Wednesday, 16 March 2016 [11:11] 03/16/2016 | 807304964971 807304964971 |
ALL YD13 PYH minor Faults [6]
ALL YD13 PYH minor Faults [6]
Fault Fault | Test Date Test Date/Time | Reference MOT Test Reference | |
---|---|---|---|
2 | Windscreen damaged but not adversely affecting driver's view (3.2 (a) (i)) Windscreen damaged but not adversely affecting driver's view (3.2 (a) (i)) | Wednesday, 20 March 2024 [17:22] 03/20/2024 Monday, 15 January 2024 [15:15] 01/15/2024 | 361361503235 361361503235 952913639647 952913639647 |
2 | Windscreen damaged but not adversely affecting driver's view in three places (3.2 (a) (i)) Windscreen damaged but not adversely affecting driver's view in three places (3.2 (a) (i)) | Wednesday, 15 December 2021 [15:53] 12/15/2021 Wednesday, 15 December 2021 [11:33] 12/15/2021 | 402853062927 402853062927 709051470696 709051470696 |
2 | Nearside front outer drive shaft joint constant velocity boot severely deteriorated (6.1.7 (g) (i)) Nearside front outer drive shaft joint constant velocity boot severely deteriorated (6.1.7 (g) (i)) | Wednesday, 15 December 2021 [15:53] 12/15/2021 Wednesday, 15 December 2021 [11:33] 12/15/2021 | 402853062927 402853062927 709051470696 709051470696 |
ALL YD13 PYH Pass With Rectification Faults [1]
ALL YD13 PYH Pass With Rectification Faults [1]
Fault Fault | Test Date Test Date/Time | Reference MOT Test Reference | |
---|---|---|---|
1 | Nearside headlamp aim too low (4.1.2 (a)) Nearside headlamp aim too low (4.1.2 (a)) | Friday, 22 March 2019 [12:44] 03/22/2019 | 210319381657 210319381657 |
MOT TEST: Wednesday, 20 March 2024 17:22:25 PASSED
MOT TEST: Wednesday, 20 March 2024 17:22:25 PASSED
This test (361361503235) was completed on the Wednesday, 20 March 2024 17:22:25 and PASSED the requirements for a valid MOT with 1 comments.
This test (361361503235) was completed on the Wednesday, 20 March 2024 17:22:25 and PASSED the requirements for a valid MOT with 1 comments.
Recorded mileage: 121,906
Recorded mileage: 121,906
MINOR
MOT TEST: Monday, 15 January 2024 15:15:41 FAILED
MOT TEST: Monday, 15 January 2024 15:15:41 FAILED
This test (952913639647) was completed on the Monday, 15 January 2024 15:15:41 and FAILED the requirements for a valid MOT with 7 comments.
This test (952913639647) was completed on the Monday, 15 January 2024 15:15:41 and FAILED the requirements for a valid MOT with 7 comments.
Recorded mileage: 121,904
Recorded mileage: 121,904
FAIL
MINOR
MOT TEST: Thursday, 29 December 2022 14:14:28 PASSED
MOT TEST: Thursday, 29 December 2022 14:14:28 PASSED
This test (129599711958) was completed on the Thursday, 29 December 2022 14:14:28 and PASSED the requirements for a valid MOT with 0 comments.
This test (129599711958) was completed on the Thursday, 29 December 2022 14:14:28 and PASSED the requirements for a valid MOT with 0 comments.
Recorded mileage: 111,096
Recorded mileage: 111,096
MOT TEST: Wednesday, 15 December 2021 15:53:41 PASSED
MOT TEST: Wednesday, 15 December 2021 15:53:41 PASSED
This test (402853062927) was completed on the Wednesday, 15 December 2021 15:53:41 and PASSED the requirements for a valid MOT with 2 comments.
This test (402853062927) was completed on the Wednesday, 15 December 2021 15:53:41 and PASSED the requirements for a valid MOT with 2 comments.
Recorded mileage: 94,834
Recorded mileage: 94,834
MINOR
MOT TEST: Wednesday, 15 December 2021 11:33:03 FAILED
MOT TEST: Wednesday, 15 December 2021 11:33:03 FAILED
This test (709051470696) was completed on the Wednesday, 15 December 2021 11:33:03 and FAILED the requirements for a valid MOT with 6 comments.
This test (709051470696) was completed on the Wednesday, 15 December 2021 11:33:03 and FAILED the requirements for a valid MOT with 6 comments.
Recorded mileage: 94,831
Recorded mileage: 94,831
ADVISORY
FAIL
MINOR
MOT TEST: Monday, 04 January 2021 14:04:35 PASSED
MOT TEST: Monday, 04 January 2021 14:04:35 PASSED
This test (100959102984) was completed on the Monday, 04 January 2021 14:04:35 and PASSED the requirements for a valid MOT with 0 comments.
This test (100959102984) was completed on the Monday, 04 January 2021 14:04:35 and PASSED the requirements for a valid MOT with 0 comments.
Recorded mileage: 79,099
Recorded mileage: 79,099
MOT TEST: Friday, 07 June 2019 08:44:34 PASSED
MOT TEST: Friday, 07 June 2019 08:44:34 PASSED
This test (307364410022) was completed on the Friday, 07 June 2019 08:44:34 and PASSED the requirements for a valid MOT with 0 comments.
This test (307364410022) was completed on the Friday, 07 June 2019 08:44:34 and PASSED the requirements for a valid MOT with 0 comments.
Recorded mileage: 39,949
Recorded mileage: 39,949
MOT TEST: Friday, 22 March 2019 12:44:21 PASSED
MOT TEST: Friday, 22 March 2019 12:44:21 PASSED
This test (886783207913) was completed on the Friday, 22 March 2019 12:44:21 and PASSED the requirements for a valid MOT with 0 comments.
This test (886783207913) was completed on the Friday, 22 March 2019 12:44:21 and PASSED the requirements for a valid MOT with 0 comments.
Recorded mileage: 39,426
Recorded mileage: 39,426
MOT TEST: Friday, 22 March 2019 12:44:20 FAILED
MOT TEST: Friday, 22 March 2019 12:44:20 FAILED
This test (210319381657) was completed on the Friday, 22 March 2019 12:44:20 and FAILED the requirements for a valid MOT with 1 comments.
This test (210319381657) was completed on the Friday, 22 March 2019 12:44:20 and FAILED the requirements for a valid MOT with 1 comments.
Recorded mileage: 39,426
Recorded mileage: 39,426
PASS WITH RECTIFICATION
MOT TEST: Thursday, 15 March 2018 10:41:56 PASSED
MOT TEST: Thursday, 15 March 2018 10:41:56 PASSED
This test (756000320085) was completed on the Thursday, 15 March 2018 10:41:56 and PASSED the requirements for a valid MOT with 0 comments.
This test (756000320085) was completed on the Thursday, 15 March 2018 10:41:56 and PASSED the requirements for a valid MOT with 0 comments.
Recorded mileage: 35,763
Recorded mileage: 35,763
MOT TEST: Wednesday, 22 March 2017 11:19:02 PASSED
MOT TEST: Wednesday, 22 March 2017 11:19:02 PASSED
This test (637507277226) was completed on the Wednesday, 22 March 2017 11:19:02 and PASSED the requirements for a valid MOT with 0 comments.
This test (637507277226) was completed on the Wednesday, 22 March 2017 11:19:02 and PASSED the requirements for a valid MOT with 0 comments.
Recorded mileage: 27,770
Recorded mileage: 27,770
MOT TEST: Thursday, 17 March 2016 14:22:42 PASSED
MOT TEST: Thursday, 17 March 2016 14:22:42 PASSED
This test (318963657884) was completed on the Thursday, 17 March 2016 14:22:42 and PASSED the requirements for a valid MOT with 1 comments.
This test (318963657884) was completed on the Thursday, 17 March 2016 14:22:42 and PASSED the requirements for a valid MOT with 1 comments.
Recorded mileage: 24,098
Recorded mileage: 24,098
ADVISORY
MOT TEST: Wednesday, 16 March 2016 11:11:06 FAILED
MOT TEST: Wednesday, 16 March 2016 11:11:06 FAILED
This test (807304964971) was completed on the Wednesday, 16 March 2016 11:11:06 and FAILED the requirements for a valid MOT with 3 comments.
This test (807304964971) was completed on the Wednesday, 16 March 2016 11:11:06 and FAILED the requirements for a valid MOT with 3 comments.
Recorded mileage: 24,098
Recorded mileage: 24,098
ADVISORY
FAIL