YKE 704A


YKE704A is registered to a Grey 1962, Morris Minor 1000 with a Petrol engine. It Failed its most recent MOT Test on the 05 June 2010

5 unique faults (6 Total) reported in its MOT History (4 Tests).

1 common/recurring faults.

50% (2) MOT Pass Rate and a 50% (2) MOT Failure Rate.

27,805 recorded miles.

YKE 704A


YKE704A is registered to a Grey 1962, Morris Minor 1000 with a Petrol engine. It Failed its most recent MOT Test on the 05 June 2010

5 unique faults (6 Total) reported in its MOT History (4 Tests).

1 common/recurring faults.

50% (2) MOT Pass Rate and a 50% (2) MOT Failure Rate.

27,805 recorded miles.

MOT PASS/Failure rate for YKE 704A

all MOT test results for YKE 704A represented as a percentage
MOT PASS/Failure rate for YKE 704A
all MOT test results for YKE 704A represented as a percentage

PERCENTAGE OF VEHICLE FAULTS WITH YKE 704A

ALL REPORTED FAULTS, DISPLAYED BY PERCENTAGE OF OCCURRENCE DURING ALL MOT TESTS
PERCENTAGE OF VEHICLE FAULTS WITH YKE 704A
ALL REPORTED FAULTS, DISPLAYED BY PERCENTAGE OF OCCURRENCE DURING ALL MOT TESTS
FAIL

USER ENTERED

YKE 704A annual Faults by type

ALL REPORTED FAULTS, DISPLAYED over time and categorised by type
YKE 704A annual Faults by type
ALL REPORTED FAULTS, DISPLAYED over time and categorised by type

ALL YKE 704A Failure Faults [4]

ALL Failure faults, ORDERED by OCCURRENCE DURING YKE 704A's MOT HISTORY
ALL YKE 704A Failure Faults [4]
ALL Failure faults, ORDERED by OCCURRENCE DURING YKE 704A's MOT HISTORY
Fail Faults | source www.vehiclestats.co.uk
Fault Fault Test Date Test Date/Time Reference MOT Test Reference
2 Nearside front suspension component mounting prescribed area is excessively corroded (2.4.a.3) Nearside front suspension component mounting prescribed area is excessively corroded (2.4.a.3) 02 June 2010 [18:28] 02/06/2010 15 May 2009 [15:06] 15/05/2009 274723250145 274723250145 300245539102 300245539102
1 Offside front torsion bar attachment bracket loose (2.4.e.4a) Offside front torsion bar attachment bracket loose (2.4.e.4a) 02 June 2010 [18:28] 02/06/2010 274723250145 274723250145
1 Brakes imbalanced across an axle (3.7.b.5b) Brakes imbalanced across an axle (3.7.b.5b) 15 May 2009 [15:06] 15/05/2009 300245539102 300245539102

ALL YKE 704A User Entered Faults [2]

ALL User Entered faults, ORDERED by OCCURRENCE DURING YKE 704A's MOT HISTORY
ALL YKE 704A User Entered Faults [2]
ALL User Entered faults, ORDERED by OCCURRENCE DURING YKE 704A's MOT HISTORY
Fail Faults | source www.vehiclestats.co.uk
Fault Fault Test Date Test Date/Time Reference MOT Test Reference
1 Slight corrosion to both front floors Slight corrosion to both front floors 02 June 2010 [18:28] 02/06/2010 274723250145 274723250145
1 Slight corrosion to both front chassis legs Slight corrosion to both front chassis legs 02 June 2010 [18:28] 02/06/2010 274723250145 274723250145

MOT TEST: 05 June 2010 18:40:44 PASSED
MOT TEST: 05 June 2010 18:40:44 PASSED

This test (683156050167) was completed on the 05 June 2010 18:40:44 and PASSED the requirements for a valid MOT with 0 comments.

This test (683156050167) was completed on the 05 June 2010 18:40:44 and PASSED the requirements for a valid MOT with 0 comments.

Recorded mileage: 2,848

Recorded mileage: 2,848


MOT TEST: 02 June 2010 18:28:20 FAILED
MOT TEST: 02 June 2010 18:28:20 FAILED

This test (274723250145) was completed on the 02 June 2010 18:28:20 and FAILED the requirements for a valid MOT with 4 comments.

This test (274723250145) was completed on the 02 June 2010 18:28:20 and FAILED the requirements for a valid MOT with 4 comments.

Recorded mileage: 2,848

Recorded mileage: 2,848


FAIL

USER ENTERED


MOT TEST: 16 May 2009 08:23:06 PASSED
MOT TEST: 16 May 2009 08:23:06 PASSED

This test (433926439140) was completed on the 16 May 2009 08:23:06 and PASSED the requirements for a valid MOT with 0 comments.

This test (433926439140) was completed on the 16 May 2009 08:23:06 and PASSED the requirements for a valid MOT with 0 comments.

Recorded mileage: 27,805

Recorded mileage: 27,805


MOT TEST: 15 May 2009 15:06:28 FAILED
MOT TEST: 15 May 2009 15:06:28 FAILED

This test (300245539102) was completed on the 15 May 2009 15:06:28 and FAILED the requirements for a valid MOT with 2 comments.

This test (300245539102) was completed on the 15 May 2009 15:06:28 and FAILED the requirements for a valid MOT with 2 comments.

Recorded mileage: 2,796

Recorded mileage: 2,796


FAIL