YYA 421H


YYA421H is registered to a Blue 1970, Morris 1100 with a Petrol engine. It Passed its most recent MOT Test on the 18 July 2019

35 unique faults (50 Total) reported in its MOT History (27 Tests).

10 common/recurring faults, the most frequent (6 times) is: Offside Rear Tyre worn close to the legal limit (4.1.E.1).

56% (15) MOT Pass Rate and a 44% (12) MOT Failure Rate.

99,488 recorded miles.

YYA 421H


YYA421H is registered to a Blue 1970, Morris 1100 with a Petrol engine. It Passed its most recent MOT Test on the 18 July 2019

35 unique faults (50 Total) reported in its MOT History (27 Tests).

10 common/recurring faults, the most frequent (6 times) is: Offside Rear Tyre worn close to the legal limit (4.1.E.1).

56% (15) MOT Pass Rate and a 44% (12) MOT Failure Rate.

99,488 recorded miles.

MOT PASS/Failure rate for YYA 421H

all MOT test results for YYA 421H represented as a percentage
MOT PASS/Failure rate for YYA 421H
all MOT test results for YYA 421H represented as a percentage

PERCENTAGE OF VEHICLE FAULTS WITH YYA 421H

ALL REPORTED FAULTS, DISPLAYED BY PERCENTAGE OF OCCURRENCE DURING ALL MOT TESTS
PERCENTAGE OF VEHICLE FAULTS WITH YYA 421H
ALL REPORTED FAULTS, DISPLAYED BY PERCENTAGE OF OCCURRENCE DURING ALL MOT TESTS
ADVISORY

FAIL

USER ENTERED

PASS WITH RECTIFICATION

YYA 421H annual Faults by type

ALL REPORTED FAULTS, DISPLAYED over time and categorised by type
YYA 421H annual Faults by type
ALL REPORTED FAULTS, DISPLAYED over time and categorised by type

RECURRING FAULTS WITH YYA 421H

FAULTS THAT HAVE OCCURED MORE THAN ONCE DURING YYA 421H's MOT HISTORY
RECURRING FAULTS WITH YYA 421H
FAULTS THAT HAVE OCCURED MORE THAN ONCE DURING YYA 421H's MOT HISTORY
Fault Fault Test Date Test Date/Time Reference MOT Test Reference
6 Offside rear tyre worn close to the legal limit (4.1.e.1) Offside rear tyre worn close to the legal limit (4.1.e.1) 11 July 2017 [13:00] 11/07/2017 11 July 2017 [10:33] 11/07/2017 17 October 2008 [12:59] 17/10/2008 17 October 2008 [12:59] 17/10/2008 02 October 2007 [17:02] 02/10/2007 02 October 2007 [17:02] 02/10/2007 505793841183 505793841183 723877027070 723877027070 550941398219 550941398219 484151098295 484151098295 562845977229 562845977229 551915777274 551915777274
3 Registration plate lamp not working (1.1.c.1d) Registration plate lamp not working (1.1.c.1d) 25 July 2014 [11:39] 25/07/2014 11 July 2013 [09:33] 11/07/2013 14 July 2011 [12:52] 14/07/2011 106086804210 106086804210 347532293181 347532293181 707745091178 707745091178
2 Nearside rear integral body structure or chassis corroded within 30cm of a mounting, but not seriously affecting overall security wheel arch inner (6.2.2 (d) (i)) Nearside rear integral body structure or chassis corroded within 30cm of a mounting, but not seriously affecting overall security wheel arch inner (6.2.2 (d) (i)) 18 July 2019 [15:56] 18/07/2019 17 July 2019 [08:49] 17/07/2019 358260694294 358260694294 915991036807 915991036807
2 Nearside front exhaust heat shield corroded on under floor Nearside front exhaust heat shield corroded on under floor 18 July 2019 [15:56] 18/07/2019 17 July 2019 [08:49] 17/07/2019 358260694294 358260694294 915991036807 915991036807
2 Front brake application uneven (3.7.b.2) Front brake application uneven (3.7.b.2) 25 July 2014 [11:39] 25/07/2014 13 July 2012 [12:32] 13/07/2012 106086804210 106086804210 359495792155 359495792155
2 Parking brake: efficiency below requirements (3.7.b.7) Parking brake: efficiency below requirements (3.7.b.7) 25 July 2014 [11:39] 25/07/2014 14 July 2011 [12:52] 14/07/2011 106086804210 106086804210 707745091178 707745091178
2 Top hose perished Top hose perished 11 July 2013 [09:33] 11/07/2013 11 July 2013 [09:33] 11/07/2013 209252093431 209252093431 347532293181 347532293181
2 Brakes imbalanced requirements only just met. It would appear that the braking system requires adjustment or repair. (3.7.b.5b) Brakes imbalanced requirements only just met. It would appear that the braking system requires adjustment or repair. (3.7.b.5b) 14 July 2009 [11:28] 14/07/2009 14 July 2009 [11:28] 14/07/2009 982115999100 982115999100 944155799124 944155799124
2 Fuel cap seal splitting Fuel cap seal splitting 17 October 2008 [12:59] 17/10/2008 17 October 2008 [12:59] 17/10/2008 550941398219 550941398219 484151098295 484151098295
2 Nearside front tyre tread depth below requirements of 1.6mm (4.1.e.1) Nearside front tyre tread depth below requirements of 1.6mm (4.1.e.1) 11 September 2006 [09:20] 11/09/2006 26 September 2005 [12:11] 26/09/2005 644034956209 644034956209 933819865280 933819865280

ALL YYA 421H ADVISORIES [14]

ALL ADVISORIES, ORDERED by OCCURRENCE DURING YYA 421H's MOT HISTORY
ALL YYA 421H ADVISORIES [14]
ALL ADVISORIES, ORDERED by OCCURRENCE DURING YYA 421H's MOT HISTORY
Advisory Faults | source www.vehiclestats.co.uk
Fault Fault Test Date Test Date/Time Reference MOT Test Reference
6 Offside rear tyre worn close to the legal limit (4.1.e.1) Offside rear tyre worn close to the legal limit (4.1.e.1) 11 July 2017 [13:00] 11/07/2017 11 July 2017 [10:33] 11/07/2017 17 October 2008 [12:59] 17/10/2008 17 October 2008 [12:59] 17/10/2008 02 October 2007 [17:02] 02/10/2007 02 October 2007 [17:02] 02/10/2007 505793841183 505793841183 723877027070 723877027070 550941398219 550941398219 484151098295 484151098295 562845977229 562845977229 551915777274 551915777274
2 Nearside rear integral body structure or chassis corroded within 30cm of a mounting, but not seriously affecting overall security wheel arch inner (6.2.2 (d) (i)) Nearside rear integral body structure or chassis corroded within 30cm of a mounting, but not seriously affecting overall security wheel arch inner (6.2.2 (d) (i)) 18 July 2019 [15:56] 18/07/2019 17 July 2019 [08:49] 17/07/2019 358260694294 358260694294 915991036807 915991036807
2 Nearside front exhaust heat shield corroded on under floor Nearside front exhaust heat shield corroded on under floor 18 July 2019 [15:56] 18/07/2019 17 July 2019 [08:49] 17/07/2019 358260694294 358260694294 915991036807 915991036807
2 Brakes imbalanced requirements only just met. It would appear that the braking system requires adjustment or repair. (3.7.b.5b) Brakes imbalanced requirements only just met. It would appear that the braking system requires adjustment or repair. (3.7.b.5b) 14 July 2009 [11:28] 14/07/2009 14 July 2009 [11:28] 14/07/2009 982115999100 982115999100 944155799124 944155799124
1 Offside rear tyre worn close to legal limit/worn on edge (5.2.3 (e)) Offside rear tyre worn close to legal limit/worn on edge (5.2.3 (e)) 11 July 2018 [14:52] 11/07/2018 384756864470 384756864470
1 Nearside rear tyre worn close to the legal limit (4.1.e.1) Nearside rear tyre worn close to the legal limit (4.1.e.1) 26 September 2005 [12:11] 26/09/2005 933819865280 933819865280

ALL YYA 421H Failure Faults [21]

ALL Failure faults, ORDERED by OCCURRENCE DURING YYA 421H's MOT HISTORY
ALL YYA 421H Failure Faults [21]
ALL Failure faults, ORDERED by OCCURRENCE DURING YYA 421H's MOT HISTORY
Fail Faults | source www.vehiclestats.co.uk
Fault Fault Test Date Test Date/Time Reference MOT Test Reference
2 Registration plate lamp not working (1.1.c.1d) Registration plate lamp not working (1.1.c.1d) 25 July 2014 [11:39] 25/07/2014 14 July 2011 [12:52] 14/07/2011 106086804210 106086804210 707745091178 707745091178
2 Front brake application uneven (3.7.b.2) Front brake application uneven (3.7.b.2) 25 July 2014 [11:39] 25/07/2014 13 July 2012 [12:32] 13/07/2012 106086804210 106086804210 359495792155 359495792155
2 Parking brake: efficiency below requirements (3.7.b.7) Parking brake: efficiency below requirements (3.7.b.7) 25 July 2014 [11:39] 25/07/2014 14 July 2011 [12:52] 14/07/2011 106086804210 106086804210 707745091178 707745091178
2 Nearside front tyre tread depth below requirements of 1.6mm (4.1.e.1) Nearside front tyre tread depth below requirements of 1.6mm (4.1.e.1) 11 September 2006 [09:20] 11/09/2006 26 September 2005 [12:11] 26/09/2005 644034956209 644034956209 933819865280 933819865280
1 Front brakes imbalanced across an axle by more than 50% (1.2.1 (b) (ii)) Front brakes imbalanced across an axle by more than 50% (1.2.1 (b) (ii)) 17 July 2019 [08:49] 17/07/2019 915991036807 915991036807
1 Front exhaust has a major leak of exhaust gases loose at front pipe/ manifold joint (7.1.2) Front exhaust has a major leak of exhaust gases loose at front pipe/ manifold joint (7.1.2) 11 July 2017 [10:33] 11/07/2017 723877027070 723877027070
1 Windscreen washer provides insufficient washer liquid (8.2.3) Windscreen washer provides insufficient washer liquid (8.2.3) 13 July 2012 [12:32] 13/07/2012 359495792155 359495792155
1 Nearside rear reflector missing (1.5.1a) Nearside rear reflector missing (1.5.1a) 14 July 2011 [12:52] 14/07/2011 707745091178 707745091178
1 Steering wheel retaining device insecure (2.1.6) Steering wheel retaining device insecure (2.1.6) 14 July 2011 [12:52] 14/07/2011 707745091178 707745091178
1 Exhaust has a major leak of exhaust gases (7.1.2) Exhaust has a major leak of exhaust gases (7.1.2) 14 July 2011 [12:52] 14/07/2011 707745091178 707745091178
1 Offside torsion bar attachment bracket corroded and seriously weakened (2.4.e.4c) Offside torsion bar attachment bracket corroded and seriously weakened (2.4.e.4c) 11 September 2006 [09:20] 11/09/2006 644034956209 644034956209
1 Rear exhaust system not adequately supported (7.1.1) Rear exhaust system not adequately supported (7.1.1) 11 September 2006 [09:20] 11/09/2006 644034956209 644034956209
1 Nearside rear suspension spring mounting prescribed area is excessively corroded (2.4.a.3) Nearside rear suspension spring mounting prescribed area is excessively corroded (2.4.a.3) 11 September 2006 [09:20] 11/09/2006 644034956209 644034956209
1 Offside rear suspension spring mounting prescribed area is excessively corroded (2.4.a.3) Offside rear suspension spring mounting prescribed area is excessively corroded (2.4.a.3) 11 September 2006 [09:20] 11/09/2006 644034956209 644034956209
1 Nearside front shock absorber has a serious fluid leak (2.7.3) Nearside front shock absorber has a serious fluid leak (2.7.3) 11 September 2006 [09:20] 11/09/2006 644034956209 644034956209
1 Front front brake application uneven (3.7.b.2) Front front brake application uneven (3.7.b.2) 11 September 2006 [09:20] 11/09/2006 644034956209 644034956209
1 Offside windscreen washer provides insufficient washer liquid (8.2.3) Offside windscreen washer provides insufficient washer liquid (8.2.3) 26 September 2005 [12:11] 26/09/2005 933819865280 933819865280

ALL YYA 421H User Entered Faults [10]

ALL User Entered faults, ORDERED by OCCURRENCE DURING YYA 421H's MOT HISTORY
ALL YYA 421H User Entered Faults [10]
ALL User Entered faults, ORDERED by OCCURRENCE DURING YYA 421H's MOT HISTORY
User Entered Faults | source www.vehiclestats.co.uk
Fault Fault Test Date Test Date/Time Reference MOT Test Reference
2 Top hose perished Top hose perished 11 July 2013 [09:33] 11/07/2013 11 July 2013 [09:33] 11/07/2013 209252093431 209252093431 347532293181 347532293181
2 Fuel cap seal splitting Fuel cap seal splitting 17 October 2008 [12:59] 17/10/2008 17 October 2008 [12:59] 17/10/2008 550941398219 550941398219 484151098295 484151098295
1 Corrosion starting to affect nearside sill Corrosion starting to affect nearside sill 19 July 2012 [15:11] 19/07/2012 229231602201 229231602201
1 Cover missing from trailer socket Cover missing from trailer socket 19 July 2012 [15:11] 19/07/2012 229231602201 229231602201
1 Trailer socket cover missing Trailer socket cover missing 13 July 2012 [12:32] 13/07/2012 359495792155 359495792155
1 Nsr and osf close to limit Nsr and osf close to limit 11 September 2006 [09:20] 11/09/2006 644034956209 644034956209
1 Rear brake hose contaminated with oil from diff. Oil leak Rear brake hose contaminated with oil from diff. Oil leak 11 September 2006 [09:20] 11/09/2006 644034956209 644034956209
1 Front inner wheel arches affected by non structual corrosion Front inner wheel arches affected by non structual corrosion 11 September 2006 [09:20] 11/09/2006 644034956209 644034956209

ALL YYA 421H Pass With Rectification Faults [5]

ALL Pass With Rectification faults, ORDERED by OCCURRENCE DURING YYA 421H's MOT HISTORY
ALL YYA 421H Pass With Rectification Faults [5]
ALL Pass With Rectification faults, ORDERED by OCCURRENCE DURING YYA 421H's MOT HISTORY
Pass With Rectification Faults | source www.vehiclestats.co.uk
Fault Fault Test Date Test Date/Time Reference MOT Test Reference
1 Nearside windscreen washer provides insufficient washer liquid (8.2.3) Nearside windscreen washer provides insufficient washer liquid (8.2.3) 12 July 2016 [15:24] 12/07/2016 490308163116 490308163116
1 Registration plate lamp not working (1.1.c.1d) Registration plate lamp not working (1.1.c.1d) 11 July 2013 [09:33] 11/07/2013 347532293181 347532293181
1 Nearside headlamp aim too high (1.8) Nearside headlamp aim too high (1.8) 14 July 2009 [11:28] 14/07/2009 944155799124 944155799124
1 Front exhaust has a major leak of exhaust gases (7.1.2) Front exhaust has a major leak of exhaust gases (7.1.2) 17 October 2008 [12:59] 17/10/2008 484151098295 484151098295
1 Registration plate lamp not working (1.1.5c) Registration plate lamp not working (1.1.5c) 02 October 2007 [17:02] 02/10/2007 551915777274 551915777274

MOT TEST: 18 July 2019 15:56:22 PASSED
MOT TEST: 18 July 2019 15:56:22 PASSED

This test (358260694294) was completed on the 18 July 2019 15:56:22 and PASSED the requirements for a valid MOT with 2 comments.

This test (358260694294) was completed on the 18 July 2019 15:56:22 and PASSED the requirements for a valid MOT with 2 comments.

Recorded mileage: 99,488

Recorded mileage: 99,488


ADVISORY


MOT TEST: 17 July 2019 08:49:27 FAILED
MOT TEST: 17 July 2019 08:49:27 FAILED

This test (915991036807) was completed on the 17 July 2019 08:49:27 and FAILED the requirements for a valid MOT with 3 comments.

This test (915991036807) was completed on the 17 July 2019 08:49:27 and FAILED the requirements for a valid MOT with 3 comments.

Recorded mileage: 99,488

Recorded mileage: 99,488


ADVISORY

FAIL


MOT TEST: 11 July 2018 14:52:08 PASSED
MOT TEST: 11 July 2018 14:52:08 PASSED

This test (384756864470) was completed on the 11 July 2018 14:52:08 and PASSED the requirements for a valid MOT with 1 comments.

This test (384756864470) was completed on the 11 July 2018 14:52:08 and PASSED the requirements for a valid MOT with 1 comments.

Recorded mileage: 99,248

Recorded mileage: 99,248


ADVISORY


MOT TEST: 11 July 2017 13:00:38 PASSED
MOT TEST: 11 July 2017 13:00:38 PASSED

This test (505793841183) was completed on the 11 July 2017 13:00:38 and PASSED the requirements for a valid MOT with 1 comments.

This test (505793841183) was completed on the 11 July 2017 13:00:38 and PASSED the requirements for a valid MOT with 1 comments.

Recorded mileage: 98,971

Recorded mileage: 98,971


ADVISORY


MOT TEST: 11 July 2017 10:33:16 FAILED
MOT TEST: 11 July 2017 10:33:16 FAILED

This test (723877027070) was completed on the 11 July 2017 10:33:16 and FAILED the requirements for a valid MOT with 2 comments.

This test (723877027070) was completed on the 11 July 2017 10:33:16 and FAILED the requirements for a valid MOT with 2 comments.

Recorded mileage: 98,971

Recorded mileage: 98,971


ADVISORY

FAIL


MOT TEST: 12 July 2016 15:24:20 PASSED
MOT TEST: 12 July 2016 15:24:20 PASSED

This test (437803962149) was completed on the 12 July 2016 15:24:20 and PASSED the requirements for a valid MOT with 0 comments.

This test (437803962149) was completed on the 12 July 2016 15:24:20 and PASSED the requirements for a valid MOT with 0 comments.

Recorded mileage: 98,723

Recorded mileage: 98,723


MOT TEST: 12 July 2016 15:24:19 FAILED
MOT TEST: 12 July 2016 15:24:19 FAILED

This test (490308163116) was completed on the 12 July 2016 15:24:19 and FAILED the requirements for a valid MOT with 1 comments.

This test (490308163116) was completed on the 12 July 2016 15:24:19 and FAILED the requirements for a valid MOT with 1 comments.

Recorded mileage: 98,723

Recorded mileage: 98,723


PASS WITH RECTIFICATION


MOT TEST: 17 July 2015 12:42:37 PASSED
MOT TEST: 17 July 2015 12:42:37 PASSED

This test (237528295157) was completed on the 17 July 2015 12:42:37 and PASSED the requirements for a valid MOT with 0 comments.

This test (237528295157) was completed on the 17 July 2015 12:42:37 and PASSED the requirements for a valid MOT with 0 comments.

Recorded mileage: 98,420

Recorded mileage: 98,420


MOT TEST: 25 July 2014 16:19:53 PASSED
MOT TEST: 25 July 2014 16:19:53 PASSED

This test (345676604485) was completed on the 25 July 2014 16:19:53 and PASSED the requirements for a valid MOT with 0 comments.

This test (345676604485) was completed on the 25 July 2014 16:19:53 and PASSED the requirements for a valid MOT with 0 comments.

Recorded mileage: 98,226

Recorded mileage: 98,226


MOT TEST: 25 July 2014 11:39:16 FAILED
MOT TEST: 25 July 2014 11:39:16 FAILED

This test (106086804210) was completed on the 25 July 2014 11:39:16 and FAILED the requirements for a valid MOT with 3 comments.

This test (106086804210) was completed on the 25 July 2014 11:39:16 and FAILED the requirements for a valid MOT with 3 comments.

Recorded mileage: 98,226

Recorded mileage: 98,226


FAIL


MOT TEST: 11 July 2013 09:33:55 PASSED
MOT TEST: 11 July 2013 09:33:55 PASSED

This test (209252093431) was completed on the 11 July 2013 09:33:55 and PASSED the requirements for a valid MOT with 1 comments.

This test (209252093431) was completed on the 11 July 2013 09:33:55 and PASSED the requirements for a valid MOT with 1 comments.

Recorded mileage: 97,908

Recorded mileage: 97,908


USER ENTERED


MOT TEST: 11 July 2013 09:33:55 FAILED
MOT TEST: 11 July 2013 09:33:55 FAILED

This test (347532293181) was completed on the 11 July 2013 09:33:55 and FAILED the requirements for a valid MOT with 2 comments.

This test (347532293181) was completed on the 11 July 2013 09:33:55 and FAILED the requirements for a valid MOT with 2 comments.

Recorded mileage: 97,908

Recorded mileage: 97,908


USER ENTERED

PASS WITH RECTIFICATION


MOT TEST: 19 July 2012 15:11:07 PASSED
MOT TEST: 19 July 2012 15:11:07 PASSED

This test (229231602201) was completed on the 19 July 2012 15:11:07 and PASSED the requirements for a valid MOT with 2 comments.

This test (229231602201) was completed on the 19 July 2012 15:11:07 and PASSED the requirements for a valid MOT with 2 comments.

Recorded mileage: 97,388

Recorded mileage: 97,388


USER ENTERED


MOT TEST: 13 July 2012 12:32:54 FAILED
MOT TEST: 13 July 2012 12:32:54 FAILED

This test (359495792155) was completed on the 13 July 2012 12:32:54 and FAILED the requirements for a valid MOT with 3 comments.

This test (359495792155) was completed on the 13 July 2012 12:32:54 and FAILED the requirements for a valid MOT with 3 comments.

Recorded mileage: 97,388

Recorded mileage: 97,388


FAIL

USER ENTERED


MOT TEST: 15 July 2011 14:02:34 PASSED
MOT TEST: 15 July 2011 14:02:34 PASSED

This test (396346291128) was completed on the 15 July 2011 14:02:34 and PASSED the requirements for a valid MOT with 0 comments.

This test (396346291128) was completed on the 15 July 2011 14:02:34 and PASSED the requirements for a valid MOT with 0 comments.

Recorded mileage: 96,752

Recorded mileage: 96,752


MOT TEST: 14 July 2011 12:52:48 FAILED
MOT TEST: 14 July 2011 12:52:48 FAILED

This test (707745091178) was completed on the 14 July 2011 12:52:48 and FAILED the requirements for a valid MOT with 5 comments.

This test (707745091178) was completed on the 14 July 2011 12:52:48 and FAILED the requirements for a valid MOT with 5 comments.

Recorded mileage: 96,752

Recorded mileage: 96,752


FAIL


MOT TEST: 11 August 2010 16:28:53 PASSED
MOT TEST: 11 August 2010 16:28:53 PASSED

This test (204113020269) was completed on the 11 August 2010 16:28:53 and PASSED the requirements for a valid MOT with 0 comments.

This test (204113020269) was completed on the 11 August 2010 16:28:53 and PASSED the requirements for a valid MOT with 0 comments.

Recorded mileage: 96,345

Recorded mileage: 96,345


MOT TEST: 14 July 2009 11:28:29 PASSED
MOT TEST: 14 July 2009 11:28:29 PASSED

This test (982115999100) was completed on the 14 July 2009 11:28:29 and PASSED the requirements for a valid MOT with 1 comments.

This test (982115999100) was completed on the 14 July 2009 11:28:29 and PASSED the requirements for a valid MOT with 1 comments.

Recorded mileage: 95,707

Recorded mileage: 95,707


ADVISORY


MOT TEST: 14 July 2009 11:28:29 FAILED
MOT TEST: 14 July 2009 11:28:29 FAILED

This test (944155799124) was completed on the 14 July 2009 11:28:29 and FAILED the requirements for a valid MOT with 2 comments.

This test (944155799124) was completed on the 14 July 2009 11:28:29 and FAILED the requirements for a valid MOT with 2 comments.

Recorded mileage: 95,707

Recorded mileage: 95,707


ADVISORY

PASS WITH RECTIFICATION


MOT TEST: 17 October 2008 12:59:59 PASSED
MOT TEST: 17 October 2008 12:59:59 PASSED

This test (550941398219) was completed on the 17 October 2008 12:59:59 and PASSED the requirements for a valid MOT with 2 comments.

This test (550941398219) was completed on the 17 October 2008 12:59:59 and PASSED the requirements for a valid MOT with 2 comments.

Recorded mileage: 95,560

Recorded mileage: 95,560


ADVISORY

USER ENTERED


MOT TEST: 17 October 2008 12:59:59 FAILED
MOT TEST: 17 October 2008 12:59:59 FAILED

This test (484151098295) was completed on the 17 October 2008 12:59:59 and FAILED the requirements for a valid MOT with 3 comments.

This test (484151098295) was completed on the 17 October 2008 12:59:59 and FAILED the requirements for a valid MOT with 3 comments.

Recorded mileage: 95,560

Recorded mileage: 95,560


ADVISORY

USER ENTERED

PASS WITH RECTIFICATION


MOT TEST: 02 October 2007 17:02:52 PASSED
MOT TEST: 02 October 2007 17:02:52 PASSED

This test (562845977229) was completed on the 02 October 2007 17:02:52 and PASSED the requirements for a valid MOT with 1 comments.

This test (562845977229) was completed on the 02 October 2007 17:02:52 and PASSED the requirements for a valid MOT with 1 comments.

Recorded mileage: 94,663

Recorded mileage: 94,663


ADVISORY


MOT TEST: 02 October 2007 17:02:52 FAILED
MOT TEST: 02 October 2007 17:02:52 FAILED

This test (551915777274) was completed on the 02 October 2007 17:02:52 and FAILED the requirements for a valid MOT with 2 comments.

This test (551915777274) was completed on the 02 October 2007 17:02:52 and FAILED the requirements for a valid MOT with 2 comments.

Recorded mileage: 94,663

Recorded mileage: 94,663


ADVISORY

PASS WITH RECTIFICATION


MOT TEST: 02 November 2006 10:46:40 PASSED
MOT TEST: 02 November 2006 10:46:40 PASSED

This test (663286006362) was completed on the 02 November 2006 10:46:40 and PASSED the requirements for a valid MOT with 0 comments.

This test (663286006362) was completed on the 02 November 2006 10:46:40 and PASSED the requirements for a valid MOT with 0 comments.

Recorded mileage: 93,269

Recorded mileage: 93,269


MOT TEST: 11 September 2006 09:20:52 FAILED
MOT TEST: 11 September 2006 09:20:52 FAILED

This test (644034956209) was completed on the 11 September 2006 09:20:52 and FAILED the requirements for a valid MOT with 10 comments.

This test (644034956209) was completed on the 11 September 2006 09:20:52 and FAILED the requirements for a valid MOT with 10 comments.

Recorded mileage: 93,206

Recorded mileage: 93,206


FAIL

USER ENTERED


MOT TEST: 26 September 2005 12:58:35 PASSED
MOT TEST: 26 September 2005 12:58:35 PASSED

This test (920009865243) was completed on the 26 September 2005 12:58:35 and PASSED the requirements for a valid MOT with 0 comments.

This test (920009865243) was completed on the 26 September 2005 12:58:35 and PASSED the requirements for a valid MOT with 0 comments.

Recorded mileage: 90,641

Recorded mileage: 90,641


MOT TEST: 26 September 2005 12:11:34 FAILED
MOT TEST: 26 September 2005 12:11:34 FAILED

This test (933819865280) was completed on the 26 September 2005 12:11:34 and FAILED the requirements for a valid MOT with 3 comments.

This test (933819865280) was completed on the 26 September 2005 12:11:34 and FAILED the requirements for a valid MOT with 3 comments.

Recorded mileage: 90,641

Recorded mileage: 90,641


ADVISORY

FAIL