YYA 648N


YYA648N is registered to a Red 1971, Morris Mini 1000 with a Petrol engine. It Failed its most recent MOT Test on the 25 April 2013

9 unique faults (10 Total) reported in its MOT History (7 Tests).

1 common/recurring faults.

43% (3) MOT Pass Rate and a 57% (4) MOT Failure Rate.

39,649 recorded miles.

YYA 648N


YYA648N is registered to a Red 1971, Morris Mini 1000 with a Petrol engine. It Failed its most recent MOT Test on the 25 April 2013

9 unique faults (10 Total) reported in its MOT History (7 Tests).

1 common/recurring faults.

43% (3) MOT Pass Rate and a 57% (4) MOT Failure Rate.

39,649 recorded miles.

MOT PASS/Failure rate for YYA 648N

all MOT test results for YYA 648N represented as a percentage
MOT PASS/Failure rate for YYA 648N
all MOT test results for YYA 648N represented as a percentage

PERCENTAGE OF VEHICLE FAULTS WITH YYA 648N

ALL REPORTED FAULTS, DISPLAYED BY PERCENTAGE OF OCCURRENCE DURING ALL MOT TESTS
PERCENTAGE OF VEHICLE FAULTS WITH YYA 648N
ALL REPORTED FAULTS, DISPLAYED BY PERCENTAGE OF OCCURRENCE DURING ALL MOT TESTS
FAIL

PASS WITH RECTIFICATION

YYA 648N annual Faults by type

ALL REPORTED FAULTS, DISPLAYED over time and categorised by type
YYA 648N annual Faults by type
ALL REPORTED FAULTS, DISPLAYED over time and categorised by type

ALL YYA 648N Failure Faults [5]

ALL Failure faults, ORDERED by OCCURRENCE DURING YYA 648N's MOT HISTORY
ALL YYA 648N Failure Faults [5]
ALL Failure faults, ORDERED by OCCURRENCE DURING YYA 648N's MOT HISTORY
Fail Faults | source www.vehiclestats.co.uk
Fault Fault Test Date Test Date/Time Reference MOT Test Reference
2 Parking brake: efficiency below requirements (3.7.b.7) Parking brake: efficiency below requirements (3.7.b.7) 06 August 2010 [14:55] 06/08/2010 04 August 2010 [08:32] 04/08/2010 443598710270 443598710270 993926210225 993926210225
1 Steering system excessively rough (2.2.d.1) Steering system excessively rough (2.2.d.1) 04 August 2010 [08:32] 04/08/2010 993926210225 993926210225
1 Offside front brake hose seriously damaged (found during steering lock to lock check) (2.2.d.2b) Offside front brake hose seriously damaged (found during steering lock to lock check) (2.2.d.2b) 04 August 2010 [08:32] 04/08/2010 993926210225 993926210225
1 Service brake: efficiency below requirements (3.7.b.7) Service brake: efficiency below requirements (3.7.b.7) 04 August 2010 [08:32] 04/08/2010 993926210225 993926210225

ALL YYA 648N Pass With Rectification Faults [5]

ALL Pass With Rectification faults, ORDERED by OCCURRENCE DURING YYA 648N's MOT HISTORY
ALL YYA 648N Pass With Rectification Faults [5]
ALL Pass With Rectification faults, ORDERED by OCCURRENCE DURING YYA 648N's MOT HISTORY
Pass With Rectification Faults | source www.vehiclestats.co.uk
Fault Fault Test Date Test Date/Time Reference MOT Test Reference
1 Nearside front lower shock absorber insecure (2.7.2b) Nearside front lower shock absorber insecure (2.7.2b) 25 April 2013 [16:57] 25/04/2013 479905013125 479905013125
1 Offside front lower shock absorber insecure (2.7.2b) Offside front lower shock absorber insecure (2.7.2b) 25 April 2013 [16:57] 25/04/2013 479905013125 479905013125
1 Rear exhaust system not adequately supported (7.1.1) Rear exhaust system not adequately supported (7.1.1) 25 April 2013 [16:57] 25/04/2013 479905013125 479905013125
1 Offside windscreen wiper blade insecure (8.2.2) Offside windscreen wiper blade insecure (8.2.2) 19 March 2012 [19:57] 19/03/2012 416669572091 416669572091
1 Exhaust has a major leak of exhaust gases (7.1.2) Exhaust has a major leak of exhaust gases (7.1.2) 19 March 2012 [19:57] 19/03/2012 416669572091 416669572091

MOT TEST: 25 April 2013 16:57:09 PASSED
MOT TEST: 25 April 2013 16:57:09 PASSED

This test (977845213169) was completed on the 25 April 2013 16:57:09 and PASSED the requirements for a valid MOT with 0 comments.

This test (977845213169) was completed on the 25 April 2013 16:57:09 and PASSED the requirements for a valid MOT with 0 comments.

Recorded mileage: 39,649

Recorded mileage: 39,649


MOT TEST: 25 April 2013 16:57:09 FAILED
MOT TEST: 25 April 2013 16:57:09 FAILED

This test (479905013125) was completed on the 25 April 2013 16:57:09 and FAILED the requirements for a valid MOT with 3 comments.

This test (479905013125) was completed on the 25 April 2013 16:57:09 and FAILED the requirements for a valid MOT with 3 comments.

Recorded mileage: 39,649

Recorded mileage: 39,649


PASS WITH RECTIFICATION


MOT TEST: 19 March 2012 19:57:53 PASSED
MOT TEST: 19 March 2012 19:57:53 PASSED

This test (358589072092) was completed on the 19 March 2012 19:57:53 and PASSED the requirements for a valid MOT with 0 comments.

This test (358589072092) was completed on the 19 March 2012 19:57:53 and PASSED the requirements for a valid MOT with 0 comments.

Recorded mileage: 39,506

Recorded mileage: 39,506


MOT TEST: 19 March 2012 19:57:53 FAILED
MOT TEST: 19 March 2012 19:57:53 FAILED

This test (416669572091) was completed on the 19 March 2012 19:57:53 and FAILED the requirements for a valid MOT with 2 comments.

This test (416669572091) was completed on the 19 March 2012 19:57:53 and FAILED the requirements for a valid MOT with 2 comments.

Recorded mileage: 39,506

Recorded mileage: 39,506


PASS WITH RECTIFICATION


MOT TEST: 10 August 2010 08:15:56 PASSED
MOT TEST: 10 August 2010 08:15:56 PASSED

This test (351862520211) was completed on the 10 August 2010 08:15:56 and PASSED the requirements for a valid MOT with 0 comments.

This test (351862520211) was completed on the 10 August 2010 08:15:56 and PASSED the requirements for a valid MOT with 0 comments.

Recorded mileage: 37,324

Recorded mileage: 37,324


MOT TEST: 06 August 2010 14:55:11 FAILED
MOT TEST: 06 August 2010 14:55:11 FAILED

This test (443598710270) was completed on the 06 August 2010 14:55:11 and FAILED the requirements for a valid MOT with 1 comments.

This test (443598710270) was completed on the 06 August 2010 14:55:11 and FAILED the requirements for a valid MOT with 1 comments.

Recorded mileage: 37,324

Recorded mileage: 37,324


FAIL


MOT TEST: 04 August 2010 08:32:44 FAILED
MOT TEST: 04 August 2010 08:32:44 FAILED

This test (993926210225) was completed on the 04 August 2010 08:32:44 and FAILED the requirements for a valid MOT with 4 comments.

This test (993926210225) was completed on the 04 August 2010 08:32:44 and FAILED the requirements for a valid MOT with 4 comments.

Recorded mileage: 37,324

Recorded mileage: 37,324


FAIL