YYC 329H


YYC329H is registered to a Blue 1970, Morris Oxford with a Petrol engine. It Failed its most recent MOT Test on the 01 August 2013

20 unique faults (30 Total) reported in its MOT History (2 Tests).

9 common/recurring faults, the most frequent (2 times) is: Front registration plate deteriorated but not likely to be misread (6.3.1d).

50% (1) MOT Pass Rate and a 50% (1) MOT Failure Rate.

29,322 recorded miles.

YYC 329H


YYC329H is registered to a Blue 1970, Morris Oxford with a Petrol engine. It Failed its most recent MOT Test on the 01 August 2013

20 unique faults (30 Total) reported in its MOT History (2 Tests).

9 common/recurring faults, the most frequent (2 times) is: Front registration plate deteriorated but not likely to be misread (6.3.1d).

50% (1) MOT Pass Rate and a 50% (1) MOT Failure Rate.

29,322 recorded miles.

MOT PASS/Failure rate for YYC 329H

all MOT test results for YYC 329H represented as a percentage
MOT PASS/Failure rate for YYC 329H
all MOT test results for YYC 329H represented as a percentage

PERCENTAGE OF VEHICLE FAULTS WITH YYC 329H

ALL REPORTED FAULTS, DISPLAYED BY PERCENTAGE OF OCCURRENCE DURING ALL MOT TESTS
PERCENTAGE OF VEHICLE FAULTS WITH YYC 329H
ALL REPORTED FAULTS, DISPLAYED BY PERCENTAGE OF OCCURRENCE DURING ALL MOT TESTS
ADVISORY

FAIL

USER ENTERED

YYC 329H annual Faults by type

ALL REPORTED FAULTS, DISPLAYED over time and categorised by type
YYC 329H annual Faults by type
ALL REPORTED FAULTS, DISPLAYED over time and categorised by type

RECURRING FAULTS WITH YYC 329H

FAULTS THAT HAVE OCCURED MORE THAN ONCE DURING YYC 329H's MOT HISTORY
RECURRING FAULTS WITH YYC 329H
FAULTS THAT HAVE OCCURED MORE THAN ONCE DURING YYC 329H's MOT HISTORY
Fault Fault Test Date Test Date/Time Reference MOT Test Reference
2 Front registration plate deteriorated but not likely to be misread (6.3.1d) Front registration plate deteriorated but not likely to be misread (6.3.1d) 01 August 2013 [10:07] 01/08/2013 29 July 2013 [14:50] 29/07/2013 336203713422 336203713422 705330813200 705330813200
2 Nearside front brake hose has slight corrosion to ferrules (3.6.b.4e) Nearside front brake hose has slight corrosion to ferrules (3.6.b.4e) 01 August 2013 [10:07] 01/08/2013 29 July 2013 [14:50] 29/07/2013 336203713422 336203713422 705330813200 705330813200
2 Offside front brake hose has slight corrosion to ferrules (3.6.b.4e) Offside front brake hose has slight corrosion to ferrules (3.6.b.4e) 01 August 2013 [10:07] 01/08/2013 29 July 2013 [14:50] 29/07/2013 336203713422 336203713422 705330813200 705330813200
2 Offside front suspension has slight play in a lower suspension ball joint (2.5.b.1a) Offside front suspension has slight play in a lower suspension ball joint (2.5.b.1a) 01 August 2013 [10:07] 01/08/2013 29 July 2013 [14:50] 29/07/2013 336203713422 336203713422 705330813200 705330813200
2 Nearside front suspension ball joint dust cover deteriorated, but preventing the ingress of dirt (2.4.g.2) Nearside front suspension ball joint dust cover deteriorated, but preventing the ingress of dirt (2.4.g.2) 01 August 2013 [10:07] 01/08/2013 29 July 2013 [14:50] 29/07/2013 336203713422 336203713422 705330813200 705330813200
2 Nearside front suspension arm rubber bush deteriorated but not resulting in excessive movement (2.4.g.2) Nearside front suspension arm rubber bush deteriorated but not resulting in excessive movement (2.4.g.2) 01 August 2013 [10:07] 01/08/2013 29 July 2013 [14:50] 29/07/2013 336203713422 336203713422 705330813200 705330813200
2 Offside front suspension arm rubber bush deteriorated but not resulting in excessive movement (2.4.g.2) Offside front suspension arm rubber bush deteriorated but not resulting in excessive movement (2.4.g.2) 01 August 2013 [10:07] 01/08/2013 29 July 2013 [14:50] 29/07/2013 336203713422 336203713422 705330813200 705330813200
2 Surface corrosion on underside of vehicle Surface corrosion on underside of vehicle 01 August 2013 [10:07] 01/08/2013 29 July 2013 [14:50] 29/07/2013 336203713422 336203713422 705330813200 705330813200
2 Fuel pipe/s corroded Fuel pipe/s corroded 01 August 2013 [10:07] 01/08/2013 29 July 2013 [14:50] 29/07/2013 336203713422 336203713422 705330813200 705330813200

ALL YYC 329H ADVISORIES [14]

ALL ADVISORIES, ORDERED by OCCURRENCE DURING YYC 329H's MOT HISTORY
ALL YYC 329H ADVISORIES [14]
ALL ADVISORIES, ORDERED by OCCURRENCE DURING YYC 329H's MOT HISTORY
Advisory Faults | source www.vehiclestats.co.uk
Fault Fault Test Date Test Date/Time Reference MOT Test Reference
2 Front registration plate deteriorated but not likely to be misread (6.3.1d) Front registration plate deteriorated but not likely to be misread (6.3.1d) 01 August 2013 [10:07] 01/08/2013 29 July 2013 [14:50] 29/07/2013 336203713422 336203713422 705330813200 705330813200
2 Nearside front brake hose has slight corrosion to ferrules (3.6.b.4e) Nearside front brake hose has slight corrosion to ferrules (3.6.b.4e) 01 August 2013 [10:07] 01/08/2013 29 July 2013 [14:50] 29/07/2013 336203713422 336203713422 705330813200 705330813200
2 Offside front brake hose has slight corrosion to ferrules (3.6.b.4e) Offside front brake hose has slight corrosion to ferrules (3.6.b.4e) 01 August 2013 [10:07] 01/08/2013 29 July 2013 [14:50] 29/07/2013 336203713422 336203713422 705330813200 705330813200
2 Offside front suspension has slight play in a lower suspension ball joint (2.5.b.1a) Offside front suspension has slight play in a lower suspension ball joint (2.5.b.1a) 01 August 2013 [10:07] 01/08/2013 29 July 2013 [14:50] 29/07/2013 336203713422 336203713422 705330813200 705330813200
2 Nearside front suspension ball joint dust cover deteriorated, but preventing the ingress of dirt (2.4.g.2) Nearside front suspension ball joint dust cover deteriorated, but preventing the ingress of dirt (2.4.g.2) 01 August 2013 [10:07] 01/08/2013 29 July 2013 [14:50] 29/07/2013 336203713422 336203713422 705330813200 705330813200
2 Nearside front suspension arm rubber bush deteriorated but not resulting in excessive movement (2.4.g.2) Nearside front suspension arm rubber bush deteriorated but not resulting in excessive movement (2.4.g.2) 01 August 2013 [10:07] 01/08/2013 29 July 2013 [14:50] 29/07/2013 336203713422 336203713422 705330813200 705330813200
2 Offside front suspension arm rubber bush deteriorated but not resulting in excessive movement (2.4.g.2) Offside front suspension arm rubber bush deteriorated but not resulting in excessive movement (2.4.g.2) 01 August 2013 [10:07] 01/08/2013 29 July 2013 [14:50] 29/07/2013 336203713422 336203713422 705330813200 705330813200

ALL YYC 329H Failure Faults [12]

ALL Failure faults, ORDERED by OCCURRENCE DURING YYC 329H's MOT HISTORY
ALL YYC 329H Failure Faults [12]
ALL Failure faults, ORDERED by OCCURRENCE DURING YYC 329H's MOT HISTORY
Fail Faults | source www.vehiclestats.co.uk
Fault Fault Test Date Test Date/Time Reference MOT Test Reference
1 Windscreen washer provides insufficient washer liquid (8.2.3) Windscreen washer provides insufficient washer liquid (8.2.3) 29 July 2013 [14:50] 29/07/2013 705330813200 705330813200
1 Nearside windscreen wiper does not clear the windscreen effectively (8.2.2) Nearside windscreen wiper does not clear the windscreen effectively (8.2.2) 29 July 2013 [14:50] 29/07/2013 705330813200 705330813200
1 Offside windscreen wiper does not clear the windscreen effectively (8.2.2) Offside windscreen wiper does not clear the windscreen effectively (8.2.2) 29 July 2013 [14:50] 29/07/2013 705330813200 705330813200
1 Rear registration plate missing (6.3.1a) Rear registration plate missing (6.3.1a) 29 July 2013 [14:50] 29/07/2013 705330813200 705330813200
1 Fuel system component leaking (7.2.3) Fuel system component leaking (7.2.3) 29 July 2013 [14:50] 29/07/2013 705330813200 705330813200
1 Nearside rear suspension component mounting prescribed area is excessively corroded (2.4.a.3) Nearside rear suspension component mounting prescribed area is excessively corroded (2.4.a.3) 29 July 2013 [14:50] 29/07/2013 705330813200 705330813200
1 Nearside front suspension component mounting prescribed area is excessively corroded (2.4.a.3) Nearside front suspension component mounting prescribed area is excessively corroded (2.4.a.3) 29 July 2013 [14:50] 29/07/2013 705330813200 705330813200
1 Offside suspension component mounting prescribed area is excessively corroded (2.4.a.3) Offside suspension component mounting prescribed area is excessively corroded (2.4.a.3) 29 July 2013 [14:50] 29/07/2013 705330813200 705330813200
1 Offside front tyre has ply or cords exposed (4.1.d.1b) Offside front tyre has ply or cords exposed (4.1.d.1b) 29 July 2013 [14:50] 29/07/2013 705330813200 705330813200
1 Nearside rear tyre has ply or cords exposed (4.1.d.1b) Nearside rear tyre has ply or cords exposed (4.1.d.1b) 29 July 2013 [14:50] 29/07/2013 705330813200 705330813200
1 Offside rear tyre has ply or cords exposed (4.1.d.1b) Offside rear tyre has ply or cords exposed (4.1.d.1b) 29 July 2013 [14:50] 29/07/2013 705330813200 705330813200

ALL YYC 329H User Entered Faults [4]

ALL User Entered faults, ORDERED by OCCURRENCE DURING YYC 329H's MOT HISTORY
ALL YYC 329H User Entered Faults [4]
ALL User Entered faults, ORDERED by OCCURRENCE DURING YYC 329H's MOT HISTORY
Advisory Faults | source www.vehiclestats.co.uk
Fault Fault Test Date Test Date/Time Reference MOT Test Reference
2 Surface corrosion on underside of vehicle Surface corrosion on underside of vehicle 01 August 2013 [10:07] 01/08/2013 29 July 2013 [14:50] 29/07/2013 336203713422 336203713422 705330813200 705330813200
2 Fuel pipe/s corroded Fuel pipe/s corroded 01 August 2013 [10:07] 01/08/2013 29 July 2013 [14:50] 29/07/2013 336203713422 336203713422 705330813200 705330813200

MOT TEST: 01 August 2013 10:07:52 PASSED
MOT TEST: 01 August 2013 10:07:52 PASSED

This test (336203713422) was completed on the 01 August 2013 10:07:52 and PASSED the requirements for a valid MOT with 9 comments.

This test (336203713422) was completed on the 01 August 2013 10:07:52 and PASSED the requirements for a valid MOT with 9 comments.

Recorded mileage: 29,322

Recorded mileage: 29,322


ADVISORY

USER ENTERED


MOT TEST: 29 July 2013 14:50:14 FAILED
MOT TEST: 29 July 2013 14:50:14 FAILED

This test (705330813200) was completed on the 29 July 2013 14:50:14 and FAILED the requirements for a valid MOT with 21 comments.

This test (705330813200) was completed on the 29 July 2013 14:50:14 and FAILED the requirements for a valid MOT with 21 comments.

Recorded mileage: 29,321

Recorded mileage: 29,321


ADVISORY

FAIL

USER ENTERED