YYC 570H


YYC570H is registered to a Green 1970, Morris 6 cwt van with a Petrol engine. It Failed its most recent MOT Test on the 06 April 2018

37 unique faults (48 Total) reported in its MOT History (15 Tests).

9 common/recurring faults, the most frequent (4 times) is: Nearside Front Shock absorber has a light misting of oil (2.7.3).

60% (9) MOT Pass Rate and a 40% (6) MOT Failure Rate.

29,141 recorded miles.

YYC 570H


YYC570H is registered to a Green 1970, Morris 6 cwt van with a Petrol engine. It Failed its most recent MOT Test on the 06 April 2018

37 unique faults (48 Total) reported in its MOT History (15 Tests).

9 common/recurring faults, the most frequent (4 times) is: Nearside Front Shock absorber has a light misting of oil (2.7.3).

60% (9) MOT Pass Rate and a 40% (6) MOT Failure Rate.

29,141 recorded miles.

MOT PASS/Failure rate for YYC 570H

all MOT test results for YYC 570H represented as a percentage
MOT PASS/Failure rate for YYC 570H
all MOT test results for YYC 570H represented as a percentage

PERCENTAGE OF VEHICLE FAULTS WITH YYC 570H

ALL REPORTED FAULTS, DISPLAYED BY PERCENTAGE OF OCCURRENCE DURING ALL MOT TESTS
PERCENTAGE OF VEHICLE FAULTS WITH YYC 570H
ALL REPORTED FAULTS, DISPLAYED BY PERCENTAGE OF OCCURRENCE DURING ALL MOT TESTS
ADVISORY

FAIL

USER ENTERED

PASS WITH RECTIFICATION

YYC 570H annual Faults by type

ALL REPORTED FAULTS, DISPLAYED over time and categorised by type
YYC 570H annual Faults by type
ALL REPORTED FAULTS, DISPLAYED over time and categorised by type

RECURRING FAULTS WITH YYC 570H

FAULTS THAT HAVE OCCURED MORE THAN ONCE DURING YYC 570H's MOT HISTORY
RECURRING FAULTS WITH YYC 570H
FAULTS THAT HAVE OCCURED MORE THAN ONCE DURING YYC 570H's MOT HISTORY
Fault Fault Test Date Test Date/Time Reference MOT Test Reference
4 Nearside front shock absorber has a light misting of oil (2.7.3) Nearside front shock absorber has a light misting of oil (2.7.3) 06 April 2018 [12:42] 06/04/2018 06 April 2018 [09:49] 06/04/2018 29 March 2017 [14:23] 29/03/2017 29 March 2017 [08:56] 29/03/2017 370711424188 370711424188 945632786019 945632786019 123912055736 123912055736 151810057118 151810057118
2 Horn not working (1.6.2a) Horn not working (1.6.2a) 06 April 2018 [09:49] 06/04/2018 29 March 2017 [08:56] 29/03/2017 945632786019 945632786019 151810057118 151810057118
2 Windscreen washer provides insufficient washer liquid (8.2.3) Windscreen washer provides insufficient washer liquid (8.2.3) 06 April 2018 [09:49] 06/04/2018 29 March 2017 [08:56] 29/03/2017 945632786019 945632786019 151810057118 151810057118
2 Rear brakes imbalanced across an axle axle 2 (3.7.b.5b) Rear brakes imbalanced across an axle axle 2 (3.7.b.5b) 06 April 2018 [09:49] 06/04/2018 29 March 2017 [08:56] 29/03/2017 945632786019 945632786019 151810057118 151810057118
2 Offside front braking system leaking (3.6.a.1) Offside front braking system leaking (3.6.a.1) 09 March 2012 [16:00] 09/03/2012 31 March 2011 [15:26] 31/03/2011 236789662074 236789662074 809540591034 809540591034
2 Brakes imbalanced requirements only just met. It would appear that the braking system requires adjustment or repair. (3.7.b.5b) Brakes imbalanced requirements only just met. It would appear that the braking system requires adjustment or repair. (3.7.b.5b) 09 March 2012 [16:00] 09/03/2012 16 March 2010 [12:21] 16/03/2010 236789662074 236789662074 561505470032 561505470032
2 Front brake pipe slightly corroded (3.6.b.2c) Front brake pipe slightly corroded (3.6.b.2c) 31 March 2011 [15:26] 31/03/2011 31 March 2011 [15:26] 31/03/2011 367220291053 367220291053 809540591034 809540591034
2 Slight tilt and wear in nearside front trunnion. Slight tilt and wear in nearside front trunnion. 31 March 2011 [15:26] 31/03/2011 31 March 2011 [15:26] 31/03/2011 367220291053 367220291053 809540591034 809540591034
2 Nail in offside front tyre Nail in offside front tyre 31 March 2011 [15:26] 31/03/2011 31 March 2011 [15:26] 31/03/2011 367220291053 367220291053 809540591034 809540591034

ALL YYC 570H ADVISORIES [17]

ALL ADVISORIES, ORDERED by OCCURRENCE DURING YYC 570H's MOT HISTORY
ALL YYC 570H ADVISORIES [17]
ALL ADVISORIES, ORDERED by OCCURRENCE DURING YYC 570H's MOT HISTORY
Advisory Faults | source www.vehiclestats.co.uk
Fault Fault Test Date Test Date/Time Reference MOT Test Reference
4 Nearside front shock absorber has a light misting of oil (2.7.3) Nearside front shock absorber has a light misting of oil (2.7.3) 06 April 2018 [12:42] 06/04/2018 06 April 2018 [09:49] 06/04/2018 29 March 2017 [14:23] 29/03/2017 29 March 2017 [08:56] 29/03/2017 370711424188 370711424188 945632786019 945632786019 123912055736 123912055736 151810057118 151810057118
2 Brakes imbalanced requirements only just met. It would appear that the braking system requires adjustment or repair. (3.7.b.5b) Brakes imbalanced requirements only just met. It would appear that the braking system requires adjustment or repair. (3.7.b.5b) 09 March 2012 [16:00] 09/03/2012 16 March 2010 [12:21] 16/03/2010 236789662074 236789662074 561505470032 561505470032
2 Front brake pipe slightly corroded (3.6.b.2c) Front brake pipe slightly corroded (3.6.b.2c) 31 March 2011 [15:26] 31/03/2011 31 March 2011 [15:26] 31/03/2011 367220291053 367220291053 809540591034 809540591034
1 Nearside rear suspension spring mounting prescribed area is corroded but not considered excessive (2.4.a.3) Nearside rear suspension spring mounting prescribed area is corroded but not considered excessive (2.4.a.3) 09 March 2012 [16:00] 09/03/2012 236789662074 236789662074
1 Service brake: service brake efficiency only just met. It would appear that the braking system requires adjustment or repair. (3.7.b.7) Service brake: service brake efficiency only just met. It would appear that the braking system requires adjustment or repair. (3.7.b.7) 09 March 2012 [16:00] 09/03/2012 236789662074 236789662074
1 Nearside front tie bar/rod rubber bush deteriorated but not resulting in excessive movement (2.4.g.2) Nearside front tie bar/rod rubber bush deteriorated but not resulting in excessive movement (2.4.g.2) 16 March 2010 [12:21] 16/03/2010 561505470032 561505470032
1 Nearside front suspension arm has slight play in a pin/bush (2.4.g.2) Nearside front suspension arm has slight play in a pin/bush (2.4.g.2) 16 March 2010 [12:21] 16/03/2010 561505470032 561505470032
1 Offside rear shock absorber has a light misting of oil (2.7.3) Offside rear shock absorber has a light misting of oil (2.7.3) 16 March 2010 [12:21] 16/03/2010 561505470032 561505470032
1 Offside front upper windscreen has damage to an area less than a 10mm circle within zone 'a' (8.3.1a) Offside front upper windscreen has damage to an area less than a 10mm circle within zone 'a' (8.3.1a) 06 March 2009 [12:48] 06/03/2009 163785669092 163785669092
1 Nearside rear tyre worn close to the legal limit (4.1.e.1) Nearside rear tyre worn close to the legal limit (4.1.e.1) 12 March 2008 [16:49] 12/03/2008 184172378461 184172378461
1 Nearside front suspension has slight play in a lower suspension ball joint (2.5.b.1a) Nearside front suspension has slight play in a lower suspension ball joint (2.5.b.1a) 29 October 2007 [16:43] 29/10/2007 150232507397 150232507397
1 Offside front suspension has slight play in a lower suspension ball joint (2.5.b.1a) Offside front suspension has slight play in a lower suspension ball joint (2.5.b.1a) 29 October 2007 [16:43] 29/10/2007 150232507397 150232507397

ALL YYC 570H Failure Faults [22]

ALL Failure faults, ORDERED by OCCURRENCE DURING YYC 570H's MOT HISTORY
ALL YYC 570H Failure Faults [22]
ALL Failure faults, ORDERED by OCCURRENCE DURING YYC 570H's MOT HISTORY
Fail Faults | source www.vehiclestats.co.uk
Fault Fault Test Date Test Date/Time Reference MOT Test Reference
2 Horn not working (1.6.2a) Horn not working (1.6.2a) 06 April 2018 [09:49] 06/04/2018 29 March 2017 [08:56] 29/03/2017 945632786019 945632786019 151810057118 151810057118
2 Windscreen washer provides insufficient washer liquid (8.2.3) Windscreen washer provides insufficient washer liquid (8.2.3) 06 April 2018 [09:49] 06/04/2018 29 March 2017 [08:56] 29/03/2017 945632786019 945632786019 151810057118 151810057118
2 Rear brakes imbalanced across an axle axle 2 (3.7.b.5b) Rear brakes imbalanced across an axle axle 2 (3.7.b.5b) 06 April 2018 [09:49] 06/04/2018 29 March 2017 [08:56] 29/03/2017 945632786019 945632786019 151810057118 151810057118
1 Nearside direction indicators flashing more than 120 times a minute (1.4.a.2g) Nearside direction indicators flashing more than 120 times a minute (1.4.a.2g) 06 April 2018 [09:49] 06/04/2018 945632786019 945632786019
1 Service brake: efficiency below requirements (3.7.b.7) Service brake: efficiency below requirements (3.7.b.7) 29 March 2017 [08:56] 29/03/2017 151810057118 151810057118
1 Parking brake: efficiency below requirements (3.7.b.7) Parking brake: efficiency below requirements (3.7.b.7) 29 March 2017 [08:56] 29/03/2017 151810057118 151810057118
1 Nearside headlamp not working on dipped beam (1.7.5a) Nearside headlamp not working on dipped beam (1.7.5a) 09 March 2012 [16:00] 09/03/2012 236789662074 236789662074
1 Nearside headlamp not working on main beam (1.7.5a) Nearside headlamp not working on main beam (1.7.5a) 09 March 2012 [16:00] 09/03/2012 236789662074 236789662074
1 Nearside rear position lamp(s) incorrect colour (1.1.a.3e) Nearside rear position lamp(s) incorrect colour (1.1.a.3e) 09 March 2012 [16:00] 09/03/2012 236789662074 236789662074
1 Nearside front tie bar/rod locating pin insecure (2.4.g.3a) Nearside front tie bar/rod locating pin insecure (2.4.g.3a) 09 March 2012 [16:00] 09/03/2012 236789662074 236789662074
1 Offside front tie bar/rod rubber bush deteriorated resulting in excessive movement (2.4.g.2) Offside front tie bar/rod rubber bush deteriorated resulting in excessive movement (2.4.g.2) 09 March 2012 [16:00] 09/03/2012 236789662074 236789662074
1 Offside lower seat belt insecurely fixed to the vehicles structure (5.2.1a) Offside lower seat belt insecurely fixed to the vehicles structure (5.2.1a) 09 March 2012 [16:00] 09/03/2012 236789662074 236789662074
1 Nearside lower seat belt anchorage prescribed area is excessively corroded (5.2.6) Nearside lower seat belt anchorage prescribed area is excessively corroded (5.2.6) 09 March 2012 [16:00] 09/03/2012 236789662074 236789662074
1 Offside rear suspension spring mounting prescribed area is excessively corroded (2.4.a.3) Offside rear suspension spring mounting prescribed area is excessively corroded (2.4.a.3) 09 March 2012 [16:00] 09/03/2012 236789662074 236789662074
1 Offside front braking system leaking (3.6.a.1) Offside front braking system leaking (3.6.a.1) 09 March 2012 [16:00] 09/03/2012 236789662074 236789662074
1 Brake pedal anti-slip provision missing (3.3.a.1b) Brake pedal anti-slip provision missing (3.3.a.1b) 09 March 2012 [16:00] 09/03/2012 236789662074 236789662074
1 Centre rear brake hose bulging under pressure (3.6.b.3) Centre rear brake hose bulging under pressure (3.6.b.3) 06 March 2009 [12:48] 06/03/2009 163785669092 163785669092
1 Front windscreen washer provides insufficient washer liquid (8.2.3) Front windscreen washer provides insufficient washer liquid (8.2.3) 12 March 2008 [16:49] 12/03/2008 184172378461 184172378461
1 Offside rear vehicle structure has excessive corrosion which adversely affects braking or steering (6.1.a.1) Offside rear vehicle structure has excessive corrosion which adversely affects braking or steering (6.1.a.1) 12 March 2008 [16:49] 12/03/2008 184172378461 184172378461

ALL YYC 570H User Entered Faults [7]

ALL User Entered faults, ORDERED by OCCURRENCE DURING YYC 570H's MOT HISTORY
ALL YYC 570H User Entered Faults [7]
ALL User Entered faults, ORDERED by OCCURRENCE DURING YYC 570H's MOT HISTORY
Advisory Faults | source www.vehiclestats.co.uk
Fault Fault Test Date Test Date/Time Reference MOT Test Reference
2 Slight tilt and wear in nearside front trunnion. Slight tilt and wear in nearside front trunnion. 31 March 2011 [15:26] 31/03/2011 31 March 2011 [15:26] 31/03/2011 367220291053 367220291053 809540591034 809540591034
2 Nail in offside front tyre Nail in offside front tyre 31 March 2011 [15:26] 31/03/2011 31 March 2011 [15:26] 31/03/2011 367220291053 367220291053 809540591034 809540591034
1 Extensive corrosion in vehicle floorpan and precribed areas, Extensive corrosion in vehicle floorpan and precribed areas, 09 March 2012 [16:00] 09/03/2012 236789662074 236789662074
1 Corrosion evident in many areas not yet excessive Corrosion evident in many areas not yet excessive 16 March 2010 [12:21] 16/03/2010 561505470032 561505470032
1 Advise;excessive corrosion been welded on chassis front to rear Advise;excessive corrosion been welded on chassis front to rear 12 March 2008 [16:49] 12/03/2008 184172378461 184172378461

ALL YYC 570H Pass With Rectification Faults [2]

ALL Pass With Rectification faults, ORDERED by OCCURRENCE DURING YYC 570H's MOT HISTORY
ALL YYC 570H Pass With Rectification Faults [2]
ALL Pass With Rectification faults, ORDERED by OCCURRENCE DURING YYC 570H's MOT HISTORY
Pass With Rectification Faults | source www.vehiclestats.co.uk
Fault Fault Test Date Test Date/Time Reference MOT Test Reference
1 Offside front braking system leaking (3.6.a.1) Offside front braking system leaking (3.6.a.1) 31 March 2011 [15:26] 31/03/2011 809540591034 809540591034
1 Centre front upper windscreen has a sticker or other obstruction encroaching into the swept area by more than 40mm outside zone 'a' (8.3.1e) Centre front upper windscreen has a sticker or other obstruction encroaching into the swept area by more than 40mm outside zone 'a' (8.3.1e) 06 March 2009 [12:48] 06/03/2009 163785669092 163785669092

MOT TEST: 06 April 2018 12:42:13 PASSED
MOT TEST: 06 April 2018 12:42:13 PASSED

This test (370711424188) was completed on the 06 April 2018 12:42:13 and PASSED the requirements for a valid MOT with 1 comments.

This test (370711424188) was completed on the 06 April 2018 12:42:13 and PASSED the requirements for a valid MOT with 1 comments.

Recorded mileage: 29,141

Recorded mileage: 29,141


ADVISORY


MOT TEST: 06 April 2018 09:49:12 FAILED
MOT TEST: 06 April 2018 09:49:12 FAILED

This test (945632786019) was completed on the 06 April 2018 09:49:12 and FAILED the requirements for a valid MOT with 5 comments.

This test (945632786019) was completed on the 06 April 2018 09:49:12 and FAILED the requirements for a valid MOT with 5 comments.

Recorded mileage: 29,139

Recorded mileage: 29,139


ADVISORY

FAIL


MOT TEST: 29 March 2017 14:23:21 PASSED
MOT TEST: 29 March 2017 14:23:21 PASSED

This test (123912055736) was completed on the 29 March 2017 14:23:21 and PASSED the requirements for a valid MOT with 1 comments.

This test (123912055736) was completed on the 29 March 2017 14:23:21 and PASSED the requirements for a valid MOT with 1 comments.

Recorded mileage: 28,429

Recorded mileage: 28,429


ADVISORY


MOT TEST: 29 March 2017 08:56:58 FAILED
MOT TEST: 29 March 2017 08:56:58 FAILED

This test (151810057118) was completed on the 29 March 2017 08:56:58 and FAILED the requirements for a valid MOT with 6 comments.

This test (151810057118) was completed on the 29 March 2017 08:56:58 and FAILED the requirements for a valid MOT with 6 comments.

Recorded mileage: 28,429

Recorded mileage: 28,429


ADVISORY

FAIL


MOT TEST: 01 April 2016 08:38:45 PASSED
MOT TEST: 01 April 2016 08:38:45 PASSED

This test (275716005230) was completed on the 01 April 2016 08:38:45 and PASSED the requirements for a valid MOT with 0 comments.

This test (275716005230) was completed on the 01 April 2016 08:38:45 and PASSED the requirements for a valid MOT with 0 comments.

Recorded mileage: 26,952

Recorded mileage: 26,952


MOT TEST: 05 April 2014 09:37:31 PASSED
MOT TEST: 05 April 2014 09:37:31 PASSED

This test (118295594026) was completed on the 05 April 2014 09:37:31 and PASSED the requirements for a valid MOT with 0 comments.

This test (118295594026) was completed on the 05 April 2014 09:37:31 and PASSED the requirements for a valid MOT with 0 comments.

Recorded mileage: 25,066

Recorded mileage: 25,066


MOT TEST: 09 March 2012 16:00:56 FAILED
MOT TEST: 09 March 2012 16:00:56 FAILED

This test (236789662074) was completed on the 09 March 2012 16:00:56 and FAILED the requirements for a valid MOT with 14 comments.

This test (236789662074) was completed on the 09 March 2012 16:00:56 and FAILED the requirements for a valid MOT with 14 comments.

Recorded mileage: 25,007

Recorded mileage: 25,007


ADVISORY

FAIL

USER ENTERED


MOT TEST: 31 March 2011 15:26:49 PASSED
MOT TEST: 31 March 2011 15:26:49 PASSED

This test (367220291053) was completed on the 31 March 2011 15:26:49 and PASSED the requirements for a valid MOT with 3 comments.

This test (367220291053) was completed on the 31 March 2011 15:26:49 and PASSED the requirements for a valid MOT with 3 comments.

Recorded mileage: 24,303

Recorded mileage: 24,303


ADVISORY

USER ENTERED


MOT TEST: 31 March 2011 15:26:49 FAILED
MOT TEST: 31 March 2011 15:26:49 FAILED

This test (809540591034) was completed on the 31 March 2011 15:26:49 and FAILED the requirements for a valid MOT with 4 comments.

This test (809540591034) was completed on the 31 March 2011 15:26:49 and FAILED the requirements for a valid MOT with 4 comments.

Recorded mileage: 24,303

Recorded mileage: 24,303


ADVISORY

USER ENTERED

PASS WITH RECTIFICATION


MOT TEST: 16 March 2010 12:21:33 PASSED
MOT TEST: 16 March 2010 12:21:33 PASSED

This test (561505470032) was completed on the 16 March 2010 12:21:33 and PASSED the requirements for a valid MOT with 5 comments.

This test (561505470032) was completed on the 16 March 2010 12:21:33 and PASSED the requirements for a valid MOT with 5 comments.

Recorded mileage: 23,595

Recorded mileage: 23,595


ADVISORY

USER ENTERED


MOT TEST: 13 March 2009 16:38:44 PASSED
MOT TEST: 13 March 2009 16:38:44 PASSED

This test (992562779022) was completed on the 13 March 2009 16:38:44 and PASSED the requirements for a valid MOT with 0 comments.

This test (992562779022) was completed on the 13 March 2009 16:38:44 and PASSED the requirements for a valid MOT with 0 comments.

Recorded mileage: 22,346

Recorded mileage: 22,346


MOT TEST: 06 March 2009 12:48:25 FAILED
MOT TEST: 06 March 2009 12:48:25 FAILED

This test (163785669092) was completed on the 06 March 2009 12:48:25 and FAILED the requirements for a valid MOT with 3 comments.

This test (163785669092) was completed on the 06 March 2009 12:48:25 and FAILED the requirements for a valid MOT with 3 comments.

Recorded mileage: 22,285

Recorded mileage: 22,285


ADVISORY

FAIL

PASS WITH RECTIFICATION


MOT TEST: 13 March 2008 10:52:56 PASSED
MOT TEST: 13 March 2008 10:52:56 PASSED

This test (173943078480) was completed on the 13 March 2008 10:52:56 and PASSED the requirements for a valid MOT with 0 comments.

This test (173943078480) was completed on the 13 March 2008 10:52:56 and PASSED the requirements for a valid MOT with 0 comments.

Recorded mileage: 19,166

Recorded mileage: 19,166


MOT TEST: 12 March 2008 16:49:11 FAILED
MOT TEST: 12 March 2008 16:49:11 FAILED

This test (184172378461) was completed on the 12 March 2008 16:49:11 and FAILED the requirements for a valid MOT with 4 comments.

This test (184172378461) was completed on the 12 March 2008 16:49:11 and FAILED the requirements for a valid MOT with 4 comments.

Recorded mileage: 19,166

Recorded mileage: 19,166


ADVISORY

FAIL

USER ENTERED


MOT TEST: 29 October 2007 16:43:31 PASSED
MOT TEST: 29 October 2007 16:43:31 PASSED

This test (150232507397) was completed on the 29 October 2007 16:43:31 and PASSED the requirements for a valid MOT with 2 comments.

This test (150232507397) was completed on the 29 October 2007 16:43:31 and PASSED the requirements for a valid MOT with 2 comments.

Recorded mileage: 18,628

Recorded mileage: 18,628


ADVISORY