YYC67


YYC67 is registered to a Green 1957, Morris Minor with a Petrol engine. It Failed its most recent MOT Test on the 23 July 2010

28 unique faults (28 Total) reported in its MOT History (4 Tests).

0 common/recurring faults.

50% (2) MOT Pass Rate and a 50% (2) MOT Failure Rate.

46,990 recorded miles.

YYC67


YYC67 is registered to a Green 1957, Morris Minor with a Petrol engine. It Failed its most recent MOT Test on the 23 July 2010

28 unique faults (28 Total) reported in its MOT History (4 Tests).

0 common/recurring faults.

50% (2) MOT Pass Rate and a 50% (2) MOT Failure Rate.

46,990 recorded miles.

MOT PASS/Failure rate for YYC67

all MOT test results for YYC67 represented as a percentage
MOT PASS/Failure rate for YYC67
all MOT test results for YYC67 represented as a percentage

PERCENTAGE OF VEHICLE FAULTS WITH YYC67

ALL REPORTED FAULTS, DISPLAYED BY PERCENTAGE OF OCCURRENCE DURING ALL MOT TESTS
PERCENTAGE OF VEHICLE FAULTS WITH YYC67
ALL REPORTED FAULTS, DISPLAYED BY PERCENTAGE OF OCCURRENCE DURING ALL MOT TESTS
ADVISORY

FAIL

USER ENTERED

YYC67 annual Faults by type

ALL REPORTED FAULTS, DISPLAYED over time and categorised by type
YYC67 annual Faults by type
ALL REPORTED FAULTS, DISPLAYED over time and categorised by type

ALL YYC67 ADVISORIES [8]

ALL ADVISORIES, ORDERED by OCCURRENCE DURING YYC67's MOT HISTORY
ALL YYC67 ADVISORIES [8]
ALL ADVISORIES, ORDERED by OCCURRENCE DURING YYC67's MOT HISTORY
Fail Faults | source www.vehiclestats.co.uk
Fault Fault Test Date Test Date/Time Reference MOT Test Reference
1 Nearside steering rack gaiter deteriorated (2.2.d.2d) Nearside steering rack gaiter deteriorated (2.2.d.2d) 29 June 2010 [18:32] 29/06/2010 884120380183 884120380183
1 Offside front wheel bearing has slight play (2.5.a.3c) Offside front wheel bearing has slight play (2.5.a.3c) 29 June 2010 [18:32] 29/06/2010 884120380183 884120380183
1 Nearside front brake hose slightly deteriorated (3.6.b.4d) Nearside front brake hose slightly deteriorated (3.6.b.4d) 29 June 2010 [18:32] 29/06/2010 884120380183 884120380183
1 Offside front brake hose slightly deteriorated (3.6.b.4d) Offside front brake hose slightly deteriorated (3.6.b.4d) 29 June 2010 [18:32] 29/06/2010 884120380183 884120380183
1 Offside front brake hose has slight corrosion to ferrules (3.6.b.4e) Offside front brake hose has slight corrosion to ferrules (3.6.b.4e) 29 June 2010 [18:32] 29/06/2010 884120380183 884120380183
1 Nearside rear suspension spring mounting prescribed area is corroded but not considered excessive (2.4.a.3) Nearside rear suspension spring mounting prescribed area is corroded but not considered excessive (2.4.a.3) 29 June 2010 [18:32] 29/06/2010 884120380183 884120380183
1 Offside rear suspension spring mounting prescribed area is corroded but not considered excessive (2.4.a.3) Offside rear suspension spring mounting prescribed area is corroded but not considered excessive (2.4.a.3) 29 June 2010 [18:32] 29/06/2010 884120380183 884120380183
1 Offside front front wheel bearing has slight play (2.5.a.3c) Offside front front wheel bearing has slight play (2.5.a.3c) 04 March 2009 [17:17] 04/03/2009 172393769010 172393769010

ALL YYC67 Failure Faults [17]

ALL Failure faults, ORDERED by OCCURRENCE DURING YYC67's MOT HISTORY
ALL YYC67 Failure Faults [17]
ALL Failure faults, ORDERED by OCCURRENCE DURING YYC67's MOT HISTORY
Fail Faults | source www.vehiclestats.co.uk
Fault Fault Test Date Test Date/Time Reference MOT Test Reference
1 Offside semaphore indicator arm does not extend smoothly (1.4.c.1a) Offside semaphore indicator arm does not extend smoothly (1.4.c.1a) 29 June 2010 [18:32] 29/06/2010 884120380183 884120380183
1 Nearside semaphore indicator arm does not retract smoothly (1.4.c.1a) Nearside semaphore indicator arm does not retract smoothly (1.4.c.1a) 29 June 2010 [18:32] 29/06/2010 884120380183 884120380183
1 Offside semaphore indicator arm arm does not show an amber light to the front (1.4.c.1b) Offside semaphore indicator arm arm does not show an amber light to the front (1.4.c.1b) 29 June 2010 [18:32] 29/06/2010 884120380183 884120380183
1 Offside semaphore indicator arm arm does not show an amber light to the rear (1.4.c.1b) Offside semaphore indicator arm arm does not show an amber light to the rear (1.4.c.1b) 29 June 2010 [18:32] 29/06/2010 884120380183 884120380183
1 Offside windscreen washer provides insufficient washer liquid (8.2.3) Offside windscreen washer provides insufficient washer liquid (8.2.3) 29 June 2010 [18:32] 29/06/2010 884120380183 884120380183
1 Semaphore indicator switch faulty (1.4.c.1c) Semaphore indicator switch faulty (1.4.c.1c) 29 June 2010 [18:32] 29/06/2010 884120380183 884120380183
1 Offside headlamp not working on main beam (1.7.5a) Offside headlamp not working on main beam (1.7.5a) 29 June 2010 [18:32] 29/06/2010 884120380183 884120380183
1 Brake pedal has insufficient reserve movement (3.3.a.5) Brake pedal has insufficient reserve movement (3.3.a.5) 29 June 2010 [18:32] 29/06/2010 884120380183 884120380183
1 Offside outer rear suspension spring mounting prescribed area is excessively corroded (2.4.a.3) Offside outer rear suspension spring mounting prescribed area is excessively corroded (2.4.a.3) 29 June 2010 [18:32] 29/06/2010 884120380183 884120380183
1 Service brake: efficiency below requirements (3.7.b.7) Service brake: efficiency below requirements (3.7.b.7) 29 June 2010 [18:32] 29/06/2010 884120380183 884120380183
1 Nearside rear mechanical brake component has restricted free movement (3.5.1k) Nearside rear mechanical brake component has restricted free movement (3.5.1k) 04 March 2009 [17:17] 04/03/2009 172393769010 172393769010
1 Offside rear mechanical brake component has restricted free movement (3.5.1k) Offside rear mechanical brake component has restricted free movement (3.5.1k) 04 March 2009 [17:17] 04/03/2009 172393769010 172393769010
1 Nearside front brake pipe excessively corroded (3.6.b.2c) Nearside front brake pipe excessively corroded (3.6.b.2c) 04 March 2009 [17:17] 04/03/2009 172393769010 172393769010
1 Offside front brake pipe excessively corroded (3.6.b.2c) Offside front brake pipe excessively corroded (3.6.b.2c) 04 March 2009 [17:17] 04/03/2009 172393769010 172393769010
1 Nearside rear brake pipe excessively corroded (3.6.b.2c) Nearside rear brake pipe excessively corroded (3.6.b.2c) 04 March 2009 [17:17] 04/03/2009 172393769010 172393769010
1 Offside rear brake pipe excessively corroded (3.6.b.2c) Offside rear brake pipe excessively corroded (3.6.b.2c) 04 March 2009 [17:17] 04/03/2009 172393769010 172393769010
1 Offside rear suspension spring mounting prescribed area is excessively corroded (2.4.a.3) Offside rear suspension spring mounting prescribed area is excessively corroded (2.4.a.3) 04 March 2009 [17:17] 04/03/2009 172393769010 172393769010

ALL YYC67 User Entered Faults [3]

ALL User Entered faults, ORDERED by OCCURRENCE DURING YYC67's MOT HISTORY
ALL YYC67 User Entered Faults [3]
ALL User Entered faults, ORDERED by OCCURRENCE DURING YYC67's MOT HISTORY
Fail Faults | source www.vehiclestats.co.uk
Fault Fault Test Date Test Date/Time Reference MOT Test Reference
1 Noise from nearside front wheel bearing Noise from nearside front wheel bearing 29 June 2010 [18:32] 29/06/2010 884120380183 884120380183
1 Rear service brake low effort Rear service brake low effort 29 June 2010 [18:32] 29/06/2010 884120380183 884120380183
1 Offside handbrake low effort Offside handbrake low effort 29 June 2010 [18:32] 29/06/2010 884120380183 884120380183

MOT TEST: 23 July 2010 12:09:12 PASSED
MOT TEST: 23 July 2010 12:09:12 PASSED

This test (261784600219) was completed on the 23 July 2010 12:09:12 and PASSED the requirements for a valid MOT with 0 comments.

This test (261784600219) was completed on the 23 July 2010 12:09:12 and PASSED the requirements for a valid MOT with 0 comments.

Recorded mileage: 46,990

Recorded mileage: 46,990


MOT TEST: 29 June 2010 18:32:01 FAILED
MOT TEST: 29 June 2010 18:32:01 FAILED

This test (884120380183) was completed on the 29 June 2010 18:32:01 and FAILED the requirements for a valid MOT with 20 comments.

This test (884120380183) was completed on the 29 June 2010 18:32:01 and FAILED the requirements for a valid MOT with 20 comments.

Recorded mileage: 46,980

Recorded mileage: 46,980


ADVISORY

FAIL

USER ENTERED


MOT TEST: 13 March 2009 17:06:08 PASSED
MOT TEST: 13 March 2009 17:06:08 PASSED

This test (661452679079) was completed on the 13 March 2009 17:06:08 and PASSED the requirements for a valid MOT with 0 comments.

This test (661452679079) was completed on the 13 March 2009 17:06:08 and PASSED the requirements for a valid MOT with 0 comments.

Recorded mileage: 46,363

Recorded mileage: 46,363


MOT TEST: 04 March 2009 17:17:13 FAILED
MOT TEST: 04 March 2009 17:17:13 FAILED

This test (172393769010) was completed on the 04 March 2009 17:17:13 and FAILED the requirements for a valid MOT with 8 comments.

This test (172393769010) was completed on the 04 March 2009 17:17:13 and FAILED the requirements for a valid MOT with 8 comments.

Recorded mileage: 46,363

Recorded mileage: 46,363


ADVISORY

FAIL